# CMAKE BUILD FAIL - openCV 4.9.0; CUDA 12.4; cuDNN 9.1.0; gcc 11.4

**URL:** <https://forum.opencv.org/t/cmake-build-fail-opencv-4-9-0-cuda-12-4-cudnn-9-1-0-gcc-11-4/17424>\
**Category:** Uncategorized\
**Tags:** build, cuda\
**Created:** [April 25, 2024, 8:46pm UTC](https://forum.opencv.org/t/cmake-build-fail-opencv-4-9-0-cuda-12-4-cudnn-9-1-0-gcc-11-4/17424 "2024-04-25T20:46:31Z")\
**Posts on this page:** 15\
**Page:** 1

<div class="post-metadata">

**Author:** ![BirdingPix](https://avatars.discourse-cdn.com/v4/letter/b/97f17d/32.png) [@BirdingPix](https://forum.opencv.org/u/BirdingPix)\
**Post date:** [April 25, 2024, 8:46pm UTC](https://forum.opencv.org/t/cmake-build-fail-opencv-4-9-0-cuda-12-4-cudnn-9-1-0-gcc-11-4/17424/1 "2024-04-25T20:46:31Z")

</div>

I’ve tried openCV 4.8.0 and 4.9.0; same errors.

Here is where the 1st error occurs:

```auto
7 errors detected in the compilation of "/home/dk/opencv490/opencv_contrib-4.9.0/modules/cudaarithm/src/cuda/minmax.cu".
CMake Error at cuda_compile_1_generated_minmax.cu.o.RELEASE.cmake:282 (message):
  Error generating file
  /home/dk/opencv490/opencv-4.9.0/build/modules/cudaarithm/CMakeFiles/cuda_compile_1.dir/src/cuda/./cuda_compile_1_generated_minmax.cu.o

```

Here is where the 2nd error occurs:

```auto

[35%] Building CXX object modules/dnn/CMakeFiles/opencv_dnn.dir/src/layers/softmax_layer.cpp.o
In file included from /home/dk/opencv490/opencv-4.9.0/modules/dnn/src/layers/../cuda4dnn/primitives/../../cuda4dnn/csl/cudnn.hpp:,
                 from /home/dk/opencv490/opencv-4.9.0/modules/dnn/src/layers/../cuda4dnn/primitives/../../op_cuda.hpp:12,
                 from /home/dk/opencv490/opencv-4.9.0/modules/dnn/src/layers/../cuda4dnn/primitives/recurrent_cells.hpp:8,
                 from /home/dk/opencv490/opencv-4.9.0/modules/dnn/src/layers/recurrent_layers.cpp:49:
/home/dk/opencv490/opencv-4.9.0/modules/dnn/src/layers/../cuda4dnn/primitives/../csl/cudnn/recurrent.hpp: In instantiation of ‘cv::dnn::cuda4dnn::csl::cudnn::RNNDescriptor<T>::RNNDescriptor(const cv::dnn::cuda4dnn::csl::cudnn::Handle&, cv::dnn::cuda4dnn::csl::cudnn::RNNDescriptor<T>::RNNMode, int, int, bool, const cv::dnn::cuda4dnn::csl::cudnn::DropoutDescriptor&) [with T = __half]’:
/home/dk/opencv490/opencv-4.9.0/modules/dnn/src/layers/../cuda4dnn/primitives/../csl/tensor_ops.hpp:541:23: required from ‘cv::dnn::cuda4dnn::csl::LSTM<T>::LSTM(cv::dnn::cuda4dnn::csl::cudnn::Handle, const cv::dnn::cuda4dnn::csl::LSTM<T>::params_type&) [with T = __half]’
/home/dk/opencv490/opencv-4.9.0/modules/dnn/src/layers/../cuda4dnn/primitives/recurrent_cells.hpp:48:21: required from ‘cv::dnn::cuda4dnn::LSTMOp<T>::LSTMOp(cv::dnn::cuda4dnn::csl::Stream, cv::dnn::cuda4dnn::csl::cudnn::Handle, const cv::Mat&, const cv::Mat&, const cv::Mat&, const cv::dnn::cuda4dnn::RNNConfiguration&) [with T = __half]’
/home/dk/opencv490/opencv-4.9.0/modules/dnn/src/layers/../cuda4dnn/primitives/../../op_cuda.hpp:194:37: required from ‘cv::Ptr<cv::dnn::dnn4_v20231225::BackendNode> cv::dnn::make_cuda_node(int, Args&& ...) [with NodeType = cv::dnn::cuda4dnn::LSTMOp; Args = {cv::dnn::cuda4dnn::csl::Stream, cv::dnn::cuda4dnn::csl::cudnn::Handle, cv::Mat&, cv::Mat&, cv::Mat&, cv::dnn::cuda4dnn::RNNConfiguration&}]’
/home/dk/opencv490/opencv-4.9.0/modules/dnn/src/layers/recurrent_layers.cpp:763:48: required from here
/home/dk/opencv490/opencv-4.9.0/modules/dnn/src/layers/../cuda4dnn/primitives/../csl/cudnn/recurrent.hpp:122:58: error: ‘cudnnSetRNNDescriptor_v6’ was not declared in this scope; did you mean ‘cudnnSetRNNDescriptor_v8’?
  122 | CUDA4DNN_CHECK_CUDNN(cudnnSetRNNDescriptor_v6(
/home/dk/opencv490/opencv-4.9.0/modules/dnn/src/layers/../cuda4dnn/primitives/../../cuda4dnn/csl/cudnn/cudnn.hpp:22:53: note: in definition of macro ‘CUDA4DNN_CHECK_CUDNN’
   22 | ::cv::dnn::cuda4dnn::csl::cudnn::detail::check((call), CV_Func, __FILE__ , __LINE__ )
      | ^~~~
/home/dk/opencv490/opencv-4.9.0/modules/dnn/src/layers/../cuda4dnn/primitives/../csl/cudnn/recurrent.hpp: In instantiation of ‘size_t cv::dnn::cuda4dnn::csl::cudnn::getRNNWorkspaceSize(const cv::dnn::cuda4dnn::csl::cudnn::Handle&, const cv::dnn::cuda4dnn::csl::cudnn::RNNDescriptor<T>&, int, const cv::dnn::cuda4dnn::csl::cudnn::TensorDescriptorsArray<T>&) [with T = __half; size_t = long unsigned int]’:
/home/dk/opencv490/opencv-4.9.0/modules/dnn/src/layers/../cuda4dnn/primitives/../csl/tensor_ops.hpp:553:58: required from ‘cv::dnn::cuda4dnn::csl::LSTM<T>::LSTM(cv::dnn::cuda4dnn::csl::cudnn::Handle, const cv::dnn::cuda4dnn::csl::LSTM<T>::params_type&) [with T = __half]’
/home/dk/opencv490/opencv-4.9.0/modules/dnn/src/layers/../cuda4dnn/primitives/recurrent_cells.hpp:48:21: required from ‘cv::dnn::cuda4dnn::LSTMOp<T>::LSTMOp(cv::dnn::cuda4dnn::csl::Stream, cv::dnn::cuda4dnn::csl::cudnn::Handle, const cv::Mat&, const cv::Mat&, const cv::Mat&, const cv::dnn::cuda4dnn::RNNConfiguration&) [with T = __half]’
/home/dk/opencv490/opencv-4.9.0/modules/dnn/src/layers/../cuda4dnn/primitives/../../op_cuda.hpp:194:37: required from ‘cv::Ptr<cv::dnn::dnn4_v20231225::BackendNode> cv::dnn::make_cuda_node(int, Args&& ...) [with NodeType = cv::dnn::cuda4dnn::LSTMOp; Args = {cv::dnn::cuda4dnn::csl::Stream, cv::dnn::cuda4dnn::csl::cudnn::Handle, cv::Mat&, cv::Mat&, cv::Mat&, cv::dnn::cuda4dnn::RNNConfiguration&}]’
/home/dk/opencv490/opencv-4.9.0/modules/dnn/src/layers/recurrent_layers.cpp:763:48: required from here
/home/dk/opencv490/opencv-4.9.0/modules/dnn/src/layers/../cuda4dnn/primitives/../csl/cudnn/recurrent.hpp:166:50: error: ‘cudnnGetRNNWorkspaceSize’ was not declared in this scope; did you mean ‘cudnnGetRNNWeightSpaceSize’?
  166 | CUDA4DNN_CHECK_CUDNN(cudnnGetRNNWorkspaceSize(handle.get(), rnnDesc.get(), seqLength,
/home/dk/opencv490/opencv-4.9.0/modules/dnn/src/layers/../cuda4dnn/primitives/../../cuda4dnn/csl/cudnn/cudnn.hpp:22:53: note: in definition of macro ‘CUDA4DNN_CHECK_CUDNN’
   22 | ::cv::dnn::cuda4dnn::csl::cudnn::detail::check((call), CV_Func, __FILE__ , __LINE__ )
      | ^~~~
/home/dk/opencv490/opencv-4.9.0/modules/dnn/src/layers/../cuda4dnn/primitives/../csl/cudnn/recurrent.hpp: In instantiation of ‘cv::dnn::cuda4dnn::csl::cudnn::RNNDescriptor<T>::RNNDescriptor(const cv::dnn::cuda4dnn::csl::cudnn::Handle&, cv::dnn::cuda4dnn::csl::cudnn::RNNDescriptor<T>::RNNMode, int, int, bool, const cv::dnn::cuda4dnn::csl::cudnn::DropoutDescriptor&) [with T = float]’:
/home/dk/opencv490/opencv-4.9.0/modules/dnn/src/layers/../cuda4dnn/primitives/../csl/tensor_ops.hpp:541:23: required from ‘cv::dnn::cuda4dnn::csl::LSTM<T>::LSTM(cv::dnn::cuda4dnn::csl::cudnn::Handle, const cv::dnn::cuda4dnn::csl::LSTM<T>::params_type&) [with T = float]’
/home/dk/opencv490/opencv-4.9.0/modules/dnn/src/layers/../cuda4dnn/primitives/recurrent_cells.hpp:48:21: required from ‘cv::dnn::cuda4dnn::LSTMOp<T>::LSTMOp(cv::dnn::cuda4dnn::csl::Stream, cv::dnn::cuda4dnn::csl::cudnn::Handle, const cv::Mat&, const cv::Mat&, const cv::Mat&, const cv::dnn::cuda4dnn::RNNConfiguration&) [with T = float]’
/home/dk/opencv490/opencv-4.9.0/modules/dnn/src/layers/../cuda4dnn/primitives/../../op_cuda.hpp:196:37: required from ‘cv::Ptr<cv::dnn::dnn4_v20231225::BackendNode> cv::dnn::make_cuda_node(int, Args&& ...) [with NodeType = cv::dnn::cuda4dnn::LSTMOp; Args = {cv::dnn::cuda4dnn::csl::Stream, cv::dnn::cuda4dnn::csl::cudnn::Handle, cv::Mat&, cv::Mat&, cv::Mat&, cv::dnn::cuda4dnn::RNNConfiguration&}]’
/home/dk/opencv490/opencv-4.9.0/modules/dnn/src/layers/recurrent_layers.cpp:763:48: required from here
/home/dk/opencv490/opencv-4.9.0/modules/dnn/src/layers/../cuda4dnn/primitives/../csl/cudnn/recurrent.hpp:122:58: error: ‘cudnnSetRNNDescriptor_v6’ was not declared in this scope; did you mean ‘cudnnSetRNNDescriptor_v8’?
  122 | CUDA4DNN_CHECK_CUDNN(cudnnSetRNNDescriptor_v6(
/home/dk/opencv490/opencv-4.9.0/modules/dnn/src/layers/../cuda4dnn/primitives/../../cuda4dnn/csl/cudnn/cudnn.hpp:22:53: note: in definition of macro ‘CUDA4DNN_CHECK_CUDNN’
   22 | ::cv::dnn::cuda4dnn::csl::cudnn::detail::check((call), CV_Func, __FILE__ , __LINE__ )
      | ^~~~
/home/dk/opencv490/opencv-4.9.0/modules/dnn/src/layers/../cuda4dnn/primitives/../csl/cudnn/recurrent.hpp: In instantiation of ‘size_t cv::dnn::cuda4dnn::csl::cudnn::getRNNWorkspaceSize(const cv::dnn::cuda4dnn::csl::cudnn::Handle&, const cv::dnn::cuda4dnn::csl::cudnn::RNNDescriptor<T>&, int, const cv::dnn::cuda4dnn::csl::cudnn::TensorDescriptorsArray<T>&) [with T = float; size_t = long unsigned int]’:
/home/dk/opencv490/opencv-4.9.0/modules/dnn/src/layers/../cuda4dnn/primitives/../csl/tensor_ops.hpp:553:58: required from ‘cv::dnn::cuda4dnn::csl::LSTM<T>::LSTM(cv::dnn::cuda4dnn::csl::cudnn::Handle, const cv::dnn::cuda4dnn::csl::LSTM<T>::params_type&) [with T = float]’
/home/dk/opencv490/opencv-4.9.0/modules/dnn/src/layers/../cuda4dnn/primitives/recurrent_cells.hpp:48:21: required from ‘cv::dnn::cuda4dnn::LSTMOp<T>::LSTMOp(cv::dnn::cuda4dnn::csl::Stream, cv::dnn::cuda4dnn::csl::cudnn::Handle, const cv::Mat&, const cv::Mat&, const cv::Mat&, const cv::dnn::cuda4dnn::RNNConfiguration&) [with T = float]’
/home/dk/opencv490/opencv-4.9.0/modules/dnn/src/layers/../cuda4dnn/primitives/../../op_cuda.hpp:196:37: required from ‘cv::Ptr<cv::dnn::dnn4_v20231225::BackendNode> cv::dnn::make_cuda_node(int, Args&& ...) [with NodeType = cv::dnn::cuda4dnn::LSTMOp; Args = {cv::dnn::cuda4dnn::csl::Stream, cv::dnn::cuda4dnn::csl::cudnn::Handle, cv::Mat&, cv::Mat&, cv::Mat&, cv::dnn::cuda4dnn::RNNConfiguration&}]’
/home/dk/opencv490/opencv-4.9.0/modules/dnn/src/layers/recurrent_layers.cpp:763:48: required from here
/home/dk/opencv490/opencv-4.9.0/modules/dnn/src/layers/../cuda4dnn/primitives/../csl/cudnn/recurrent.hpp:166:50: error: ‘cudnnGetRNNWorkspaceSize’ was not declared in this scope; did you mean ‘cudnnGetRNNWeightSpaceSize’?
  166 | CUDA4DNN_CHECK_CUDNN(cudnnGetRNNWorkspaceSize(handle.get(), rnnDesc.get(), seqLength,
/home/dk/opencv490/opencv-4.9.0/modules/dnn/src/layers/../cuda4dnn/primitives/../../cuda4dnn/csl/cudnn/cudnn.hpp:22:53: note: in definition of macro ‘CUDA4DNN_CHECK_CUDNN’
   22 | ::cv::dnn::cuda4dnn::csl::cudnn::detail::check((call), CV_Func, __FILE__ , __LINE__ )
      | ^~~~
[35%] Building CXX object modules/dnn/CMakeFiles/opencv_dnn.dir/src/layers/split_layer.cpp.o
[35%] Building CXX object modules/dnn/CMakeFiles/opencv_dnn.dir/src/layers/tile_layer.cpp.o
/home/dk/opencv490/opencv-4.9.0/modules/dnn/src/layers/../cuda4dnn/primitives/../csl/cudnn/recurrent.hpp: In instantiation of ‘void cv::dnn::cuda4dnn::csl::cudnn::LSTMForward(const cv::dnn::cuda4dnn::csl::cudnn::Handle&, const cv::dnn::cuda4dnn::csl::cudnn::RNNDescriptor<T>&, const cv::dnn::cuda4dnn::csl::cudnn::FilterDescriptor<T>&, cv::dnn::cuda4dnn::csl::DevicePtr<const T>, const cv::dnn::cuda4dnn::csl::cudnn::TensorDescriptorsArray<T>&, cv::dnn::cuda4dnn::csl::DevicePtr<const T>, const cv::dnn::cuda4dnn::csl::cudnn::TensorDescriptor<T>&, cv::dnn::cuda4dnn::csl::DevicePtr<const T>, const cv::dnn::cuda4dnn::csl::cudnn::TensorDescriptor<T>&, cv::dnn::cuda4dnn::csl::DevicePtr<const T>, int, const cv::dnn::cuda4dnn::csl::cudnn::TensorDescriptorsArray<T>&, cv::dnn::cuda4dnn::csl::DevicePtr<T>, cv::dnn::cuda4dnn::csl::DevicePtr<T>, cv::dnn::cuda4dnn::csl::WorkspaceInstance) [with T = float]’:
/home/dk/opencv490/opencv-4.9.0/modules/dnn/src/layers/../cuda4dnn/primitives/../csl/tensor_ops.hpp:563:34: required from ‘void cv::dnn::cuda4dnn::csl::LSTM<T>::inference(cv::dnn::cuda4dnn::csl::TensorView<T>, cv::dnn::cuda4dnn::csl::TensorSpan<T>, cv::dnn::cuda4dnn::csl::TensorSpan<T>, cv::dnn::cuda4dnn::csl::TensorView<T>, cv::dnn::cuda4dnn::csl::TensorView<T>, cv::dnn::cuda4dnn::csl::TensorView<T>, cv::dnn::cuda4dnn::csl::WorkspaceInstance) [with T = float]’
/home/dk/opencv490/opencv-4.9.0/modules/dnn/src/layers/../cuda4dnn/primitives/recurrent_cells.hpp:79:23: required from ‘void cv::dnn::cuda4dnn::LSTMOp<T>::forward(const std::vector<cv::Ptr<cv::dnn::dnn4_v20231225::BackendWrapper> >&, const std::vector<cv::Ptr<cv::dnn::dnn4_v20231225::BackendWrapper> >&, cv::dnn::cuda4dnn::csl::Workspace&) [with T = float]’
/home/dk/opencv490/opencv-4.9.0/modules/dnn/src/layers/../cuda4dnn/primitives/recurrent_cells.hpp:63:10: required from here
/home/dk/opencv490/opencv-4.9.0/modules/dnn/src/layers/../cuda4dnn/primitives/../csl/cudnn/recurrent.hpp:182:50: error: ‘cudnnRNNForwardInference’ was not declared in this scope
  182 | CUDA4DNN_CHECK_CUDNN(cudnnRNNForwardInference(handle.get(), rnnDesc.get(), seqLength,
/home/dk/opencv490/opencv-4.9.0/modules/dnn/src/layers/../cuda4dnn/primitives/../../cuda4dnn/csl/cudnn/cudnn.hpp:22:53: note: in definition of macro ‘CUDA4DNN_CHECK_CUDNN’
   22 | ::cv::dnn::cuda4dnn::csl::cudnn::detail::check((call), CV_Func, __FILE__ , __LINE__ )
      | ^~~~
/home/dk/opencv490/opencv-4.9.0/modules/dnn/src/layers/../cuda4dnn/primitives/../csl/cudnn/recurrent.hpp: In instantiation of ‘void cv::dnn::cuda4dnn::csl::cudnn::LSTMForward(const cv::dnn::cuda4dnn::csl::cudnn::Handle&, const cv::dnn::cuda4dnn::csl::cudnn::RNNDescriptor<T>&, const cv::dnn::cuda4dnn::csl::cudnn::FilterDescriptor<T>&, cv::dnn::cuda4dnn::csl::DevicePtr<const T>, const cv::dnn::cuda4dnn::csl::cudnn::TensorDescriptorsArray<T>&, cv::dnn::cuda4dnn::csl::DevicePtr<const T>, const cv::dnn::cuda4dnn::csl::cudnn::TensorDescriptor<T>&, cv::dnn::cuda4dnn::csl::DevicePtr<const T>, const cv::dnn::cuda4dnn::csl::cudnn::TensorDescriptor<T>&, cv::dnn::cuda4dnn::csl::DevicePtr<const T>, int, const cv::dnn::cuda4dnn::csl::cudnn::TensorDescriptorsArray<T>&, cv::dnn::cuda4dnn::csl::DevicePtr<T>, cv::dnn::cuda4dnn::csl::DevicePtr<T>, cv::dnn::cuda4dnn::csl::WorkspaceInstance) [with T = __half]’:
/home/dk/opencv490/opencv-4.9.0/modules/dnn/src/layers/../cuda4dnn/primitives/../csl/tensor_ops.hpp:563:34: required from ‘void cv::dnn::cuda4dnn::csl::LSTM<T>::inference(cv::dnn::cuda4dnn::csl::TensorView<T>, cv::dnn::cuda4dnn::csl::TensorSpan<T>, cv::dnn::cuda4dnn::csl::TensorSpan<T>, cv::dnn::cuda4dnn::csl::TensorView<T>, cv::dnn::cuda4dnn::csl::TensorView<T>, cv::dnn::cuda4dnn::csl::TensorView<T>, cv::dnn::cuda4dnn::csl::WorkspaceInstance) [with T = __half]’
/home/dk/opencv490/opencv-4.9.0/modules/dnn/src/layers/../cuda4dnn/primitives/recurrent_cells.hpp:79:23: required from ‘void cv::dnn::cuda4dnn::LSTMOp<T>::forward(const std::vector<cv::Ptr<cv::dnn::dnn4_v20231225::BackendWrapper> >&, const std::vector<cv::Ptr<cv::dnn::dnn4_v20231225::BackendWrapper> >&, cv::dnn::cuda4dnn::csl::Workspace&) [with T = __half]’
/home/dk/opencv490/opencv-4.9.0/modules/dnn/src/layers/../cuda4dnn/primitives/recurrent_cells.hpp:63:10: required from here
/home/dk/opencv490/opencv-4.9.0/modules/dnn/src/layers/../cuda4dnn/primitives/../csl/cudnn/recurrent.hpp:182:50: error: ‘cudnnRNNForwardInference’ was not declared in this scope
  182 | CUDA4DNN_CHECK_CUDNN(cudnnRNNForwardInference(handle.get(), rnnDesc.get(), seqLength,
/home/dk/opencv490/opencv-4.9.0/modules/dnn/src/layers/../cuda4dnn/primitives/../../cuda4dnn/csl/cudnn/cudnn.hpp:22:53: note: in definition of macro ‘CUDA4DNN_CHECK_CUDNN’
   22 | ::cv::dnn::cuda4dnn::csl::cudnn::detail::check((call), CV_Func, __FILE__ , __LINE__ )
      | ^~~~
make[2]: *** [modules/dnn/CMakeFiles/opencv_dnn.dir/build.make:1386: modules/dnn/CMakeFiles/opencv_dnn.dir/src/layers/recurrent_layers.cpp.o] Error 1
make[2]: *** Waiting for unfinished jobs....
make[1]: *** [CMakeFiles/Makefile2:5793: modules/dnn/CMakeFiles/opencv_dnn.dir/all] Error 2
[35%] Building CXX object modules/cudawarping/CMakeFiles/opencv_cudawarping.dir/src/pyramids.cpp.o
[35%] Building CXX object modules/cudawarping/CMakeFiles/opencv_cudawarping.dir/src/remap.cpp.o
[36%] Building CXX object modules/cudawarping/CMakeFiles/opencv_cudawarping.dir/src/resize.cpp.o
[36%] Building CXX object modules/cudawarping/CMakeFiles/opencv_cudawarping.dir/src/warp.cpp.o
[36%] Linking CXX shared library ../../lib/libopencv_cudawarping.so
[36%] Built target opencv_cudawarping
make: *** [Makefile:166: all] Error 2

```

openCV build config:

```auto

-- 
-- General configuration for OpenCV 4.9.0 =====================================
-- Version control: unknown
-- 
-- Extra modules:
-- Location (extra): /home/dk/opencv490/opencv_contrib-4.9.0/modules
-- Version control (extra): unknown
-- 
-- Platform:
-- Timestamp: 2024-04-25T20:21:23Z
-- Host: Linux 6.5.0-28-generic x86_64
-- CMake: 3.22.1
-- CMake generator: Unix Makefiles
-- CMake build tool: /usr/bin/gmake
-- Configuration: RELEASE
-- 
-- CPU/HW features:
-- Baseline: SSE SSE2 SSE3
-- requested: SSE3
-- Dispatched code generation: SSE4_1 SSE4_2 FP16 AVX AVX2 AVX512_SKX
-- requested: SSE4_1 SSE4_2 AVX FP16 AVX2 AVX512_SKX
-- SSE4_1 (16 files): + SSSE3 SSE4_1
-- SSE4_2 (1 files): + SSSE3 SSE4_1 POPCNT SSE4_2
-- FP16 (0 files): + SSSE3 SSE4_1 POPCNT SSE4_2 FP16 AVX
-- AVX (8 files): + SSSE3 SSE4_1 POPCNT SSE4_2 AVX
-- AVX2 (36 files): + SSSE3 SSE4_1 POPCNT SSE4_2 FP16 FMA3 AVX AVX2
-- AVX512_SKX (5 files): + SSSE3 SSE4_1 POPCNT SSE4_2 FP16 FMA3 AVX AVX2 AVX_512F AVX512_COMMON AVX512_SKX
-- 
-- C/C++:
-- Built as dynamic libs?: YES
-- C++ standard: 11
-- C++ Compiler: /usr/bin/g++-11 (ver 11.4.0)
-- C++ flags (Release): -fsigned-char -ffast-math -fno-finite-math-only -W -Wall -Wreturn-type -Wnon-virtual-dtor -Waddress -Wsequence-point -Wformat -Wformat-security -Wmissing-declarations -Wundef -Winit-self -Wpointer-arith -Wshadow -Wsign-promo -Wuninitialized -Wsuggest-override -Wno-delete-non-virtual-dtor -Wno-comment -Wimplicit-fallthrough=3 -Wno-strict-overflow -fdiagnostics-show-option -Wno-long-long -pthread -fomit-frame-pointer -ffunction-sections -fdata-sections -msse -msse2 -msse3 -fvisibility=hidden -fvisibility-inlines-hidden -fopenmp -O3 -DNDEBUG -DNDEBUG
-- C++ flags (Debug): -fsigned-char -ffast-math -fno-finite-math-only -W -Wall -Wreturn-type -Wnon-virtual-dtor -Waddress -Wsequence-point -Wformat -Wformat-security -Wmissing-declarations -Wundef -Winit-self -Wpointer-arith -Wshadow -Wsign-promo -Wuninitialized -Wsuggest-override -Wno-delete-non-virtual-dtor -Wno-comment -Wimplicit-fallthrough=3 -Wno-strict-overflow -fdiagnostics-show-option -Wno-long-long -pthread -fomit-frame-pointer -ffunction-sections -fdata-sections -msse -msse2 -msse3 -fvisibility=hidden -fvisibility-inlines-hidden -fopenmp -g -O0 -DDEBUG -D_DEBUG
-- C Compiler: /usr/bin/gcc-11
-- C flags (Release): -fsigned-char -ffast-math -fno-finite-math-only -W -Wall -Wreturn-type -Waddress -Wsequence-point -Wformat -Wformat-security -Wmissing-declarations -Wmissing-prototypes -Wstrict-prototypes -Wundef -Winit-self -Wpointer-arith -Wshadow -Wuninitialized -Wno-comment -Wimplicit-fallthrough=3 -Wno-strict-overflow -fdiagnostics-show-option -Wno-long-long -pthread -fomit-frame-pointer -ffunction-sections -fdata-sections -msse -msse2 -msse3 -fvisibility=hidden -fopenmp -O3 -DNDEBUG -DNDEBUG
-- C flags (Debug): -fsigned-char -ffast-math -fno-finite-math-only -W -Wall -Wreturn-type -Waddress -Wsequence-point -Wformat -Wformat-security -Wmissing-declarations -Wmissing-prototypes -Wstrict-prototypes -Wundef -Winit-self -Wpointer-arith -Wshadow -Wuninitialized -Wno-comment -Wimplicit-fallthrough=3 -Wno-strict-overflow -fdiagnostics-show-option -Wno-long-long -pthread -fomit-frame-pointer -ffunction-sections -fdata-sections -msse -msse2 -msse3 -fvisibility=hidden -fopenmp -g -O0 -DDEBUG -D_DEBUG
-- Linker flags (Release): -Wl,--exclude-libs,libippicv.a -Wl,--exclude-libs,libippiw.a -Wl,--gc-sections -Wl,--as-needed -Wl,--no-undefined  
-- Linker flags (Debug): -Wl,--exclude-libs,libippicv.a -Wl,--exclude-libs,libippiw.a -Wl,--gc-sections -Wl,--as-needed -Wl,--no-undefined  
-- ccache: NO
-- Precompiled headers: NO
-- Extra dependencies: m pthread cudart_static dl rt nppc nppial nppicc nppidei nppif nppig nppim nppist nppisu nppitc npps cublas cudnn cufft -L/usr/local/cuda/lib64 -L/usr/lib/x86_64-linux-gnu
-- 3rdparty dependencies:
-- 
-- OpenCV modules:
-- To be built: aruco bgsegm bioinspired calib3d ccalib core cudaarithm cudabgsegm cudacodec cudafeatures2d cudafilters cudaimgproc cudalegacy cudaobjdetect cudaoptflow cudastereo cudawarping cudev datasets dnn dnn_objdetect dnn_superres dpm face features2d flann freetype fuzzy gapi hfs highgui img_hash imgcodecs imgproc intensity_transform line_descriptor mcc ml objdetect optflow phase_unwrapping photo plot python3 quality rapid reg rgbd saliency shape stereo stitching structured_light superres surface_matching text tracking video videoio videostab wechat_qrcode xfeatures2d ximgproc xobjdetect xphoto
-- Disabled: world
-- Disabled by dependency: -
-- Unavailable: alphamat cannops cvv hdf java julia matlab ovis python2 sfm ts viz
-- Applications: examples apps
-- Documentation: NO
-- Non-free algorithms: NO
-- 
-- GUI: GTK3
-- GTK+: YES (ver 3.24.33)
-- GThread : YES (ver 2.72.4)
-- GtkGlExt: NO
-- OpenGL support: NO
-- VTK support: NO
-- 
-- Media I/O: 
-- ZLib: /usr/lib/x86_64-linux-gnu/libz.so (ver 1.2.11)
-- JPEG: /usr/lib/x86_64-linux-gnu/libjpeg.so (ver 80)
-- WEBP: build (ver encoder: 0x020f)
-- PNG: /usr/lib/x86_64-linux-gnu/libpng.so (ver 1.6.37)
-- TIFF: /usr/lib/x86_64-linux-gnu/libtiff.so (ver 42 / 4.3.0)
-- JPEG 2000: build (ver 2.5.0)
-- OpenEXR: /usr/lib/x86_64-linux-gnu/libImath-2_5.so /usr/lib/x86_64-linux-gnu/libIlmImf-2_5.so /usr/lib/x86_64-linux-gnu/libIex-2_5.so /usr/lib/x86_64-linux-gnu/libHalf-2_5.so /usr/lib/x86_64-linux-gnu/libIlmThread-2_5.so (ver 2_5)
-- HDR: YES
-- SUNRASTER: YES
-- PXM: YES
-- PFM: YES
-- 
-- Video I/O:
-- DC1394: NO
-- FFMPEG: YES
-- avcodec: YES (58.134.100)
-- avformat: YES (58.76.100)
-- avutil: YES (56.70.100)
-- swscale: YES (5.9.100)
-- avresample: NO
-- GStreamer: YES (1.20.3)
-- v4l/v4l2: YES (linux/videodev2.h)
-- 
-- Parallel framework: TBB (ver 2020.2 interface 11102)
-- 
-- Trace: YES (with Intel ITT)
-- 
-- Other third-party libraries:
-- Intel IPP: 2021.10.0 [2021.10.0]
-- at: /home/dk/opencv490/opencv-4.9.0/build/3rdparty/ippicv/ippicv_lnx/icv
-- Intel IPP IW: sources (2021.10.0)
-- at: /home/dk/opencv490/opencv-4.9.0/build/3rdparty/ippicv/ippicv_lnx/iw
-- VA: NO
-- Lapack: NO
-- Eigen: NO
-- Custom HAL: NO
-- Protobuf: build (3.19.1)
-- Flatbuffers: builtin/3rdparty (23.5.9)
-- 
-- NVIDIA CUDA: YES (ver 12.4, CUFFT CUBLAS NVCUVID NVCUVENC FAST_MATH)
-- NVIDIA GPU arch: 50 52 60 61 70 75 80 86 89 90
-- NVIDIA PTX archs: 90
-- 
-- cuDNN: YES (ver 9.1.0)
-- 
-- OpenCL: YES (no extra features)
-- Include path: /home/dk/opencv490/opencv-4.9.0/3rdparty/include/opencl/1.2
-- Link libraries: Dynamic load
-- 
-- Python 3:
-- Interpreter: /home/dk/.virtualenvs/cv/bin/python (ver 3.10.12)
-- Libraries: /usr/lib/x86_64-linux-gnu/libpython3.10.so (ver 3.10.12)
-- numpy: /home/dk/.virtualenvs/cv/lib/python3.10/site-packages/numpy/core/include (ver 1.26.4)
-- install path: ~/.virtualenvs/cv/lib/python3.10/site-packages/cv2/python-3.10
-- 
-- Python (for build): /home/dk/.virtualenvs/cv/bin/python
-- 
-- Java:                          
-- ant: NO
-- Java: NO
-- JNI: NO
-- Java wrappers: NO
-- Java tests: NO
-- 
-- Install to: /usr/local
-- -----------------------------------------------------------------
-- 
-- Configuring done
-- Generating done
-- Build files have been written to: /home/dk/opencv490/opencv-4.9.0/build

```

I’ve tried many things… nothing helps. Maybe need to install OLDER GCC? Not sure exactly how I should do that safely.

Need some advice on what my issue is.

---

<div class="post-metadata">

**Author:** ![laurent.berger](https://avatars.discourse-cdn.com/v4/letter/l/ec9cab/32.png) [@laurent.berger](https://forum.opencv.org/u/laurent.berger)\
**Post date:** [April 25, 2024, 8:53pm UTC](https://forum.opencv.org/t/cmake-build-fail-opencv-4-9-0-cuda-12-4-cudnn-9-1-0-gcc-11-4/17424/2 "2024-04-25T20:53:52Z")

</div>

> [@BirdingPix](#):
>
> `VIDIA CUDA: YES (ver 12.4, CUFFT CUBLAS NVCUVID NVCUVENC FAST_MATH)`

Again [Issues · opencv/opencv · GitHub](https://github.com/opencv/opencv/issues?q=is%3Aopen+is%3Aissue+12.4)

> <https://github.com/opencv/opencv/issues/25461#issuecomment-2067107500>
>
> \### System Information
> 
> hey everyone 
> im trying to compile the OpenCv 4.x with …cuda but im having error everytime, eventhough i tried cuda 12.4, 12.3 also Cudnn 9.x and 8.x, i was hoping if some one can help me solve this issue 
> 
> pls find my computer informations and the terminal output in the text file (attachements).
> 
> thanks and regards
> \[Opencv cuda.txt\](https://github.com/opencv/opencv/files/15040181/Opencv.cuda.txt)
> 
> 
> \### Detailed description
> 
> t\_core.dir/test/test\_logtagmanager.cpp.o
> \[30%\] Building NVCC (Device) object modules/cudev/test/CMakeFiles/opencv\_test\_cudev.dir/opencv\_test\_cudev\_generated\_test\_pyramids.cu.o
> \[30%\] Building CXX object modules/imgproc/CMakeFiles/opencv\_test\_imgproc.dir/test/ocl/test\_color.cpp.o
> \[30%\] Linking CXX shared library ../../lib/libopencv\_cudawarping.so
> \[30%\] Built target opencv\_cudawarping
> Scanning dependencies of target opencv\_test\_intensity\_transform
> \[30%\] Building CXX object modules/intensity\_transform/CMakeFiles/opencv\_test\_intensity\_transform.dir/test/test\_intensity\_transform.cpp.o
> \[30%\] Building CXX object modules/imgproc/CMakeFiles/opencv\_perf\_imgproc.dir/perf/opencl/perf\_imgproc.cpp.o
> \[30%\] Building CXX object modules/imgproc/CMakeFiles/opencv\_perf\_imgproc.dir/perf/opencl/perf\_imgwarp.cpp.o
> Scanning dependencies of target opencv\_test\_ml
> \[30%\] Building CXX object modules/ml/CMakeFiles/opencv\_test\_ml.dir/test/test\_ann.cpp.o
> \[30%\] Building CXX object modules/dnn/CMakeFiles/opencv\_dnn.dir/src/layers/correlation\_layer.cpp.o
> \[30%\] Linking CXX executable ../../bin/opencv\_perf\_core
> \[30%\] Built target opencv\_perf\_core
> \[30%\] Building CXX object modules/intensity\_transform/CMakeFiles/opencv\_test\_intensity\_transform.dir/test/test\_main.cpp.o
> Scanning dependencies of target opencv\_test\_phase\_unwrapping
> \[30%\] Building CXX object modules/phase\_unwrapping/CMakeFiles/opencv\_test\_phase\_unwrapping.dir/test/test\_main.cpp.o
> \[30%\] Building CXX object modules/dnn/CMakeFiles/opencv\_dnn.dir/src/layers/cpu\_kernels/conv\_depthwise.cpp.o
> Scanning dependencies of target opencv\_test\_quality
> \[30%\] Building CXX object modules/quality/CMakeFiles/opencv\_test\_quality.dir/test/test\_brisque.cpp.o
> \[30%\] Building CXX object modules/ml/CMakeFiles/opencv\_test\_ml.dir/test/test\_bayes.cpp.o
> \[30%\] Linking CXX executable ../../bin/opencv\_test\_intensity\_transform
> \[30%\] Building CXX object modules/phase\_unwrapping/CMakeFiles/opencv\_test\_phase\_unwrapping.dir/test/test\_unwrapping.cpp.o
> \[30%\] Building CXX object modules/core/CMakeFiles/opencv\_test\_core.dir/test/test\_lpsolver.cpp.o
> \[30%\] Built target opencv\_test\_intensity\_transform
> Scanning dependencies of target opencv\_test\_reg
> \[30%\] Building CXX object modules/reg/CMakeFiles/opencv\_test\_reg.dir/test/test\_main.cpp.o
> \[30%\] Building CXX object modules/reg/CMakeFiles/opencv\_test\_reg.dir/test/test\_reg.cpp.o
> \[30%\] Building CXX object modules/dnn/CMakeFiles/opencv\_dnn.dir/src/layers/cpu\_kernels/conv\_winograd\_f63.cpp.o
> \[30%\] Linking CXX executable ../../bin/opencv\_test\_phase\_unwrapping
> \[30%\] Building CXX object modules/ml/CMakeFiles/opencv\_test\_ml.dir/test/test\_em.cpp.o
> \[30%\] Building CXX object modules/ml/CMakeFiles/opencv\_test\_ml.dir/test/test\_kmeans.cpp.o
> \[30%\] Built target opencv\_test\_phase\_unwrapping
> \[30%\] Building CXX object modules/ml/CMakeFiles/opencv\_test\_ml.dir/test/test\_knearest.cpp.o
> \[30%\] Building CXX object modules/quality/CMakeFiles/opencv\_test\_quality.dir/test/test\_gmsd.cpp.o
> \[30%\] Building CXX object modules/dnn/CMakeFiles/opencv\_dnn.dir/src/layers/cpu\_kernels/convolution.cpp.o
> \[30%\] Building CXX object modules/imgproc/CMakeFiles/opencv\_perf\_imgproc.dir/perf/opencl/perf\_matchTemplate.cpp.o
> \[30%\] Linking CXX executable ../../bin/opencv\_test\_reg
> \[30%\] Building CXX object modules/imgproc/CMakeFiles/opencv\_perf\_imgproc.dir/perf/opencl/perf\_moments.cpp.o
> \[30%\] Building CXX object modules/core/CMakeFiles/opencv\_test\_core.dir/test/test\_main.cpp.o
> \[30%\] Building CXX object modules/core/CMakeFiles/opencv\_test\_core.dir/test/test\_mat.cpp.o
> \[30%\] Built target opencv\_test\_reg
> Scanning dependencies of target opencv\_perf\_reg
> \[30%\] Building CXX object modules/reg/CMakeFiles/opencv\_perf\_reg.dir/perf/perf\_main.cpp.o
> \[30%\] Building CXX object modules/ml/CMakeFiles/opencv\_test\_ml.dir/test/test\_lr.cpp.o
> \[30%\] Building CXX object modules/quality/CMakeFiles/opencv\_test\_quality.dir/test/test\_main.cpp.o
> \[30%\] Building CXX object modules/ml/CMakeFiles/opencv\_test\_ml.dir/test/test\_main.cpp.o
> \[30%\] Building CXX object modules/reg/CMakeFiles/opencv\_perf\_reg.dir/perf/perf\_reg.cpp.o
> \[30%\] Building NVCC (Device) object modules/cudev/test/CMakeFiles/opencv\_test\_cudev.dir/opencv\_test\_cudev\_generated\_test\_reduction.cu.o
> \[30%\] Building CXX object modules/ml/CMakeFiles/opencv\_test\_ml.dir/test/test\_mltests.cpp.o
> \[31%\] Building CXX object modules/ml/CMakeFiles/opencv\_test\_ml.dir/test/test\_rtrees.cpp.o
> \[31%\] Building CXX object modules/ml/CMakeFiles/opencv\_test\_ml.dir/test/test\_save\_load.cpp.o
> \[31%\] Building CXX object modules/quality/CMakeFiles/opencv\_test\_quality.dir/test/test\_mse.cpp.o
> \[31%\] Building CXX object modules/ml/CMakeFiles/opencv\_test\_ml.dir/test/test\_svmsgd.cpp.o
> \[31%\] Building CXX object modules/dnn/CMakeFiles/opencv\_dnn.dir/src/layers/cpu\_kernels/fast\_gemm.cpp.o
> \[31%\] Building CXX object modules/imgproc/CMakeFiles/opencv\_test\_imgproc.dir/test/ocl/test\_filter2d.cpp.o
> \[31%\] Building CXX object modules/imgproc/CMakeFiles/opencv\_perf\_imgproc.dir/perf/opencl/perf\_pyramid.cpp.o
> \[31%\] Building CXX object modules/imgproc/CMakeFiles/opencv\_perf\_imgproc.dir/perf/perf\_accumulate.cpp.o
> \[31%\] Building CXX object modules/quality/CMakeFiles/opencv\_test\_quality.dir/test/test\_psnr.cpp.o
> \[31%\] Building CXX object modules/ml/CMakeFiles/opencv\_test\_ml.dir/test/test\_svmtrainauto.cpp.o
> \[31%\] Building CXX object modules/dnn/CMakeFiles/opencv\_dnn.dir/src/layers/cpu\_kernels/fast\_norm.cpp.o
> \[31%\] Building CXX object modules/core/CMakeFiles/opencv\_test\_core.dir/test/test\_math.cpp.o
> \[31%\] Linking CXX executable ../../bin/opencv\_perf\_reg
> \[31%\] Built target opencv\_perf\_reg
> Scanning dependencies of target opencv\_perf\_signal
> \[31%\] Building CXX object modules/signal/CMakeFiles/opencv\_perf\_signal.dir/perf/perf\_main.cpp.o
> \[31%\] Building NVCC (Device) object modules/cudev/test/CMakeFiles/opencv\_test\_cudev.dir/opencv\_test\_cudev\_generated\_test\_scan.cu.o
> \[31%\] Building CXX object modules/dnn/CMakeFiles/opencv\_dnn.dir/src/layers/cpu\_kernels/softmax.cpp.o
> Scanning dependencies of target opencv\_test\_signal
> \[31%\] Building CXX object modules/signal/CMakeFiles/opencv\_test\_signal.dir/test/test\_main.cpp.o
> \[31%\] Building NVCC (Device) object modules/cudafilters/CMakeFiles/cuda\_compile\_1.dir/src/cuda/cuda\_compile\_1\_generated\_row\_filter.8uc4.cu.o
> \[31%\] Building CXX object modules/imgproc/CMakeFiles/opencv\_test\_imgproc.dir/test/ocl/test\_filters.cpp.o
> \[31%\] Building CXX object modules/imgproc/CMakeFiles/opencv\_test\_imgproc.dir/test/ocl/test\_gftt.cpp.o
> \[31%\] Building CXX object modules/signal/CMakeFiles/opencv\_perf\_signal.dir/perf/perf\_resample.cpp.o
> \[31%\] Building CXX object modules/quality/CMakeFiles/opencv\_test\_quality.dir/test/test\_ssim.cpp.o
> \[31%\] Building CXX object modules/ml/CMakeFiles/opencv\_test\_ml.dir/test/test\_utils.cpp.o
> \[31%\] Building CXX object modules/dnn/CMakeFiles/opencv\_dnn.dir/src/layers/crop\_and\_resize\_layer.cpp.o
> \[32%\] Building CXX object modules/signal/CMakeFiles/opencv\_test\_signal.dir/test/test\_signal.cpp.o
> \[32%\] Linking CXX executable ../../bin/opencv\_perf\_signal
> \[32%\] Built target opencv\_perf\_signal
> Scanning dependencies of target opencv\_perf\_cudawarping
> \[32%\] Building CXX object modules/cudawarping/CMakeFiles/opencv\_perf\_cudawarping.dir/perf/perf\_main.cpp.o
> \[32%\] Linking CXX executable ../../bin/opencv\_test\_quality
> \[32%\] Linking CXX executable ../../bin/opencv\_test\_ml
> \[32%\] Built target opencv\_test\_quality
> \[32%\] Building CXX object modules/dnn/CMakeFiles/opencv\_dnn.dir/src/layers/cumsum\_layer.cpp.o
> \[32%\] Built target opencv\_test\_ml
> \[32%\] Building CXX object modules/dnn/CMakeFiles/opencv\_dnn.dir/src/layers/detection\_output\_layer.cpp.o
> \[32%\] Building CXX object modules/imgproc/CMakeFiles/opencv\_test\_imgproc.dir/test/ocl/test\_histogram.cpp.o
> \[33%\] Building CXX object modules/imgproc/CMakeFiles/opencv\_test\_imgproc.dir/test/ocl/test\_houghlines.cpp.o
> \[33%\] Linking CXX executable ../../bin/opencv\_test\_signal
> \[33%\] Building CXX object modules/imgproc/CMakeFiles/opencv\_perf\_imgproc.dir/perf/perf\_bilateral.cpp.o
> \[33%\] Building CXX object modules/cudawarping/CMakeFiles/opencv\_perf\_cudawarping.dir/perf/perf\_warping.cpp.o
> \[33%\] Built target opencv\_test\_signal
> Scanning dependencies of target opencv\_test\_cudawarping
> \[33%\] Building CXX object modules/cudawarping/CMakeFiles/opencv\_test\_cudawarping.dir/test/test\_main.cpp.o
> \[33%\] Building CXX object modules/cudawarping/CMakeFiles/opencv\_test\_cudawarping.dir/test/test\_pyramids.cpp.o
> \[33%\] Building CXX object modules/core/CMakeFiles/opencv\_test\_core.dir/test/test\_misc.cpp.o
> \[33%\] Building CXX object modules/cudawarping/CMakeFiles/opencv\_test\_cudawarping.dir/test/test\_remap.cpp.o
> \[33%\] Building CXX object modules/cudawarping/CMakeFiles/opencv\_test\_cudawarping.dir/test/test\_resize.cpp.o
> \[33%\] Building CXX object modules/imgproc/CMakeFiles/opencv\_perf\_imgproc.dir/perf/perf\_blur.cpp.o
> \[34%\] Building CXX object modules/cudawarping/CMakeFiles/opencv\_test\_cudawarping.dir/test/test\_warp\_affine.cpp.o
> \[34%\] Building CXX object modules/core/CMakeFiles/opencv\_test\_core.dir/test/test\_opencl.cpp.o
> \[34%\] Building CXX object modules/imgproc/CMakeFiles/opencv\_test\_imgproc.dir/test/ocl/test\_imgproc.cpp.o
> \[34%\] Building CXX object modules/dnn/CMakeFiles/opencv\_dnn.dir/src/layers/einsum\_layer.cpp.o
> \[34%\] Building CXX object modules/dnn/CMakeFiles/opencv\_dnn.dir/src/layers/elementwise\_layers.cpp.o
> \[34%\] Building CXX object modules/dnn/CMakeFiles/opencv\_dnn.dir/src/layers/eltwise\_layer.cpp.o
> \[34%\] Building CXX object modules/core/CMakeFiles/opencv\_test\_core.dir/test/test\_operations.cpp.o
> \[34%\] Linking CXX executable ../../bin/opencv\_perf\_cudawarping
> \[34%\] Built target opencv\_perf\_cudawarping
> \[34%\] Building CXX object modules/core/CMakeFiles/opencv\_test\_core.dir/test/test\_ptr.cpp.o
> \[34%\] Building CXX object modules/core/CMakeFiles/opencv\_test\_core.dir/test/test\_quaternion.cpp.o
> \[34%\] Building CXX object modules/core/CMakeFiles/opencv\_test\_core.dir/test/test\_rand.cpp.o
> \[34%\] Building CXX object modules/dnn/CMakeFiles/opencv\_dnn.dir/src/layers/expand\_layer.cpp.o
> \[34%\] Building CXX object modules/cudawarping/CMakeFiles/opencv\_test\_cudawarping.dir/test/test\_warp\_perspective.cpp.o
> \[34%\] Building CXX object modules/dnn/CMakeFiles/opencv\_dnn.dir/src/layers/flatten\_layer.cpp.o
> \[34%\] Building CXX object modules/imgproc/CMakeFiles/opencv\_perf\_imgproc.dir/perf/perf\_canny.cpp.o
> \[34%\] Building CXX object modules/imgproc/CMakeFiles/opencv\_perf\_imgproc.dir/perf/perf\_contours.cpp.o
> \[35%\] Building CXX object modules/dnn/CMakeFiles/opencv\_dnn.dir/src/layers/flow\_warp\_layer.cpp.o
> \[35%\] Building CXX object modules/core/CMakeFiles/opencv\_test\_core.dir/test/test\_rotatedrect.cpp.o
> \[35%\] Building CXX object modules/imgproc/CMakeFiles/opencv\_test\_imgproc.dir/test/ocl/test\_match\_template.cpp.o
> \[35%\] Building CXX object modules/dnn/CMakeFiles/opencv\_dnn.dir/src/layers/fully\_connected\_layer.cpp.o
> \[35%\] Building NVCC (Device) object modules/cudafilters/CMakeFiles/cuda\_compile\_1.dir/src/cuda/cuda\_compile\_1\_generated\_column\_filter.16sc1.cu.o
> \[35%\] Building CXX object modules/core/CMakeFiles/opencv\_test\_core.dir/test/test\_umat.cpp.o
> \[35%\] Building CXX object modules/core/CMakeFiles/opencv\_test\_core.dir/test/test\_utils.cpp.o
> \[35%\] Building CXX object modules/imgproc/CMakeFiles/opencv\_perf\_imgproc.dir/perf/perf\_corners.cpp.o
> \[35%\] Building NVCC (Device) object modules/cudafilters/CMakeFiles/cuda\_compile\_1.dir/src/cuda/cuda\_compile\_1\_generated\_column\_filter.16sc3.cu.o
> \[35%\] Linking CXX executable ../../bin/opencv\_test\_cudawarping
> \[35%\] Built target opencv\_test\_cudawarping
> \[35%\] Building NVCC (Device) object modules/cudafilters/CMakeFiles/cuda\_compile\_1.dir/src/cuda/cuda\_compile\_1\_generated\_column\_filter.16sc4.cu.o
> \[35%\] Building CXX object modules/imgproc/CMakeFiles/opencv\_test\_imgproc.dir/test/ocl/test\_medianfilter.cpp.o
> \[35%\] Building CXX object modules/imgproc/CMakeFiles/opencv\_perf\_imgproc.dir/perf/perf\_cvt\_color.cpp.o
> \[35%\] Building CXX object modules/imgproc/CMakeFiles/opencv\_perf\_imgproc.dir/perf/perf\_distanceTransform.cpp.o
> \[35%\] Building CXX object modules/dnn/CMakeFiles/opencv\_dnn.dir/src/layers/gather\_elements\_layer.cpp.o
> Scanning dependencies of target opencv\_perf\_features2d
> \[35%\] Building CXX object modules/features2d/CMakeFiles/opencv\_perf\_features2d.dir/perf/opencl/perf\_brute\_force\_matcher.cpp.o
> \[35%\] Building CXX object modules/imgproc/CMakeFiles/opencv\_test\_imgproc.dir/test/ocl/test\_pyramids.cpp.o
> \[35%\] Building CXX object modules/imgproc/CMakeFiles/opencv\_test\_imgproc.dir/test/ocl/test\_sepfilter2d.cpp.o
> \[35%\] Building CXX object modules/dnn/CMakeFiles/opencv\_dnn.dir/src/layers/gather\_layer.cpp.o
> \[36%\] Building NVCC (Device) object modules/cudafilters/CMakeFiles/cuda\_compile\_1.dir/src/cuda/cuda\_compile\_1\_generated\_column\_filter.16uc1.cu.o
> \[36%\] Building NVCC (Device) object modules/cudafilters/CMakeFiles/cuda\_compile\_1.dir/src/cuda/cuda\_compile\_1\_generated\_column\_filter.16uc3.cu.o
> \[36%\] Building CXX object modules/dnn/CMakeFiles/opencv\_dnn.dir/src/layers/gemm\_layer.cpp.o
> \[36%\] Building CXX object modules/features2d/CMakeFiles/opencv\_perf\_features2d.dir/perf/opencl/perf\_feature2d.cpp.o
> \[36%\] Building CXX object modules/imgproc/CMakeFiles/opencv\_test\_imgproc.dir/test/ocl/test\_warp.cpp.o
> \[36%\] Building CXX object modules/core/CMakeFiles/opencv\_test\_core.dir/test/test\_intrin128.sse2.cpp.o
> \[37%\] Building CXX object modules/imgproc/CMakeFiles/opencv\_perf\_imgproc.dir/perf/perf\_filter2d.cpp.o
> \[37%\] Building CXX object modules/imgproc/CMakeFiles/opencv\_perf\_imgproc.dir/perf/perf\_floodfill.cpp.o
> \[37%\] Building CXX object modules/dnn/CMakeFiles/opencv\_dnn.dir/src/layers/group\_norm\_layer.cpp.o
> \[37%\] Building CXX object modules/features2d/CMakeFiles/opencv\_perf\_features2d.dir/perf/perf\_batchDistance.cpp.o
> \[37%\] Building CXX object modules/imgproc/CMakeFiles/opencv\_perf\_imgproc.dir/perf/perf\_goodFeaturesToTrack.cpp.o
> \[37%\] Building CXX object modules/imgproc/CMakeFiles/opencv\_perf\_imgproc.dir/perf/perf\_histogram.cpp.o
> \[37%\] Building CXX object modules/dnn/CMakeFiles/opencv\_dnn.dir/src/layers/instance\_norm\_layer.cpp.o
> \[37%\] Building CXX object modules/imgproc/CMakeFiles/opencv\_perf\_imgproc.dir/perf/perf\_houghcircles.cpp.o
> \[37%\] Building CXX object modules/features2d/CMakeFiles/opencv\_perf\_features2d.dir/perf/perf\_feature2d.cpp.o
> \[37%\] Building CXX object modules/imgproc/CMakeFiles/opencv\_test\_imgproc.dir/test/test\_approxpoly.cpp.o
> \[37%\] Building CXX object modules/dnn/CMakeFiles/opencv\_dnn.dir/src/layers/layer\_norm.cpp.o
> \[37%\] Building NVCC (Device) object modules/cudev/test/CMakeFiles/opencv\_test\_cudev.dir/opencv\_test\_cudev\_generated\_test\_split\_merge.cu.o
> \[37%\] Building CXX object modules/imgproc/CMakeFiles/opencv\_perf\_imgproc.dir/perf/perf\_houghlines.cpp.o
> Scanning dependencies of target opencv\_cudastereo
> \[37%\] Building CXX object modules/cudastereo/CMakeFiles/opencv\_cudastereo.dir/src/disparity\_bilateral\_filter.cpp.o
> \[37%\] Building CXX object modules/imgproc/CMakeFiles/opencv\_test\_imgproc.dir/test/test\_bilateral\_filter.cpp.o
> \[37%\] Building CXX object modules/features2d/CMakeFiles/opencv\_perf\_features2d.dir/perf/perf\_main.cpp.o
> \[37%\] Building CXX object modules/cudastereo/CMakeFiles/opencv\_cudastereo.dir/src/stereobm.cpp.o
> \[37%\] Building CXX object modules/dnn/CMakeFiles/opencv\_dnn.dir/src/layers/layers\_common.cpp.o
> \[37%\] Linking CXX executable ../../bin/opencv\_perf\_features2d
> \[37%\] Built target opencv\_perf\_features2d
> \[37%\] Building CXX object modules/cudastereo/CMakeFiles/opencv\_cudastereo.dir/src/stereobp.cpp.o
> \[37%\] Building CXX object modules/imgproc/CMakeFiles/opencv\_perf\_imgproc.dir/perf/perf\_integral.cpp.o
> \[37%\] Building CXX object modules/imgproc/CMakeFiles/opencv\_test\_imgproc.dir/test/test\_boundingrect.cpp.o
> \[37%\] Building CXX object modules/cudastereo/CMakeFiles/opencv\_cudastereo.dir/src/stereocsbp.cpp.o
> \[37%\] Building CXX object modules/dnn/CMakeFiles/opencv\_dnn.dir/src/layers/lrn\_layer.cpp.o
> \[37%\] Building CXX object modules/dnn/CMakeFiles/opencv\_dnn.dir/src/layers/matmul\_layer.cpp.o
> \[37%\] Building CXX object modules/dnn/CMakeFiles/opencv\_dnn.dir/src/layers/max\_unpooling\_layer.cpp.o
> \[37%\] Building CXX object modules/cudastereo/CMakeFiles/opencv\_cudastereo.dir/src/stereosgm.cpp.o
> \[37%\] Building CXX object modules/imgproc/CMakeFiles/opencv\_test\_imgproc.dir/test/test\_canny.cpp.o
> \[37%\] Building CXX object modules/imgproc/CMakeFiles/opencv\_perf\_imgproc.dir/perf/perf\_intelligent\_scissors.cpp.o
> \[37%\] Building CXX object modules/imgproc/CMakeFiles/opencv\_test\_imgproc.dir/test/test\_color.cpp.o
> \[37%\] Building CXX object modules/cudastereo/CMakeFiles/opencv\_cudastereo.dir/src/util.cpp.o
> \[37%\] Building CXX object modules/dnn/CMakeFiles/opencv\_dnn.dir/src/layers/mvn\_layer.cpp.o
> \[37%\] Building CXX object modules/dnn/CMakeFiles/opencv\_dnn.dir/src/layers/nary\_eltwise\_layers.cpp.o
> \[37%\] Building CXX object modules/imgproc/CMakeFiles/opencv\_perf\_imgproc.dir/perf/perf\_main.cpp.o
> \[37%\] Building CXX object modules/core/CMakeFiles/opencv\_test\_core.dir/test/test\_intrin128.sse3.cpp.o
> \[37%\] Linking CXX shared library ../../lib/libopencv\_cudastereo.so
> \[37%\] Building CXX object modules/imgproc/CMakeFiles/opencv\_test\_imgproc.dir/test/test\_connectedcomponents.cpp.o
> \[37%\] Built target opencv\_cudastereo
> \[37%\] Building CXX object modules/imgproc/CMakeFiles/opencv\_test\_imgproc.dir/test/test\_contours.cpp.o
> \[37%\] Building CXX object modules/imgproc/CMakeFiles/opencv\_perf\_imgproc.dir/perf/perf\_matchTemplate.cpp.o
> \[37%\] Building CXX object modules/imgproc/CMakeFiles/opencv\_test\_imgproc.dir/test/test\_contours\_new.cpp.o
> \[37%\] Building CXX object modules/dnn/CMakeFiles/opencv\_dnn.dir/src/layers/normalize\_bbox\_layer.cpp.o
> \[37%\] Building CXX object modules/imgproc/CMakeFiles/opencv\_perf\_imgproc.dir/perf/perf\_moments.cpp.o
> \[37%\] Building CXX object modules/imgproc/CMakeFiles/opencv\_perf\_imgproc.dir/perf/perf\_morph.cpp.o
> \[37%\] Building CXX object modules/imgproc/CMakeFiles/opencv\_test\_imgproc.dir/test/test\_convhull.cpp.o
> \[37%\] Building CXX object modules/dnn/CMakeFiles/opencv\_dnn.dir/src/layers/not\_implemented\_layer.cpp.o
> \[37%\] Building NVCC (Device) object modules/cudev/test/CMakeFiles/opencv\_test\_cudev.dir/opencv\_test\_cudev\_generated\_test\_warp.cu.o
> \[37%\] Building CXX object modules/imgproc/CMakeFiles/opencv\_test\_imgproc.dir/test/test\_cornersubpix.cpp.o
> Scanning dependencies of target opencv\_test\_features2d
> \[37%\] Building CXX object modules/imgproc/CMakeFiles/opencv\_perf\_imgproc.dir/perf/perf\_phasecorr.cpp.o
> \[37%\] Building CXX object modules/features2d/CMakeFiles/opencv\_test\_features2d.dir/test/ocl/test\_brute\_force\_matcher.cpp.o
> \[37%\] Building CXX object modules/dnn/CMakeFiles/opencv\_dnn.dir/src/layers/padding\_layer.cpp.o
> \[37%\] Building CXX object modules/dnn/CMakeFiles/opencv\_dnn.dir/src/layers/permute\_layer.cpp.o
> \[37%\] Building CXX object modules/imgproc/CMakeFiles/opencv\_perf\_imgproc.dir/perf/perf\_pyramids.cpp.o
> \[37%\] Building CXX object modules/imgproc/CMakeFiles/opencv\_perf\_imgproc.dir/perf/perf\_remap.cpp.o
> \[37%\] Building CXX object modules/features2d/CMakeFiles/opencv\_test\_features2d.dir/test/ocl/test\_feature2d.cpp.o
> \[37%\] Building CXX object modules/dnn/CMakeFiles/opencv\_dnn.dir/src/layers/pooling\_layer.cpp.o
> Scanning dependencies of target opencv\_test\_freetype
> \[37%\] Building CXX object modules/imgproc/CMakeFiles/opencv\_test\_imgproc.dir/test/test\_cvtyuv.cpp.o
> \[37%\] Building CXX object modules/freetype/CMakeFiles/opencv\_test\_freetype.dir/test/test\_basic.cpp.o
> \[37%\] Building CXX object modules/freetype/CMakeFiles/opencv\_test\_freetype.dir/test/test\_main.cpp.o
> \[37%\] Building CXX object modules/freetype/CMakeFiles/opencv\_test\_freetype.dir/test/test\_putText.cpp.o
> \[37%\] Building CXX object modules/features2d/CMakeFiles/opencv\_test\_features2d.dir/test/test\_affine\_feature.cpp.o
> \[37%\] Building CXX object modules/imgproc/CMakeFiles/opencv\_perf\_imgproc.dir/perf/perf\_resize.cpp.o
> \[37%\] Building CXX object modules/imgproc/CMakeFiles/opencv\_perf\_imgproc.dir/perf/perf\_sepfilters.cpp.o
> \[37%\] Building CXX object modules/imgproc/CMakeFiles/opencv\_test\_imgproc.dir/test/test\_distancetransform.cpp.o
> \[37%\] Building CXX object modules/dnn/CMakeFiles/opencv\_dnn.dir/src/layers/prior\_box\_layer.cpp.o
> \[37%\] Building CXX object modules/dnn/CMakeFiles/opencv\_dnn.dir/src/layers/proposal\_layer.cpp.o
> \[37%\] Linking CXX executable ../../bin/opencv\_test\_freetype
> \[37%\] Building CXX object modules/features2d/CMakeFiles/opencv\_test\_features2d.dir/test/test\_agast.cpp.o
> \[37%\] Built target opencv\_test\_freetype
> \[37%\] Building CXX object modules/features2d/CMakeFiles/opencv\_test\_features2d.dir/test/test\_akaze.cpp.o
> \[37%\] Building CXX object modules/dnn/CMakeFiles/opencv\_dnn.dir/src/layers/recurrent\_layers.cpp.o
> \[37%\] Building CXX object modules/features2d/CMakeFiles/opencv\_test\_features2d.dir/test/test\_blobdetector.cpp.o
> \[37%\] Building CXX object modules/imgproc/CMakeFiles/opencv\_test\_imgproc.dir/test/test\_drawing.cpp.o
> \[37%\] Building CXX object modules/dnn/CMakeFiles/opencv\_dnn.dir/src/layers/reduce\_layer.cpp.o
> \[37%\] Building CXX object modules/dnn/CMakeFiles/opencv\_dnn.dir/src/layers/region\_layer.cpp.o
> In file included from /home/barkati/opencv/modules/dnn/src/layers/../cuda4dnn/primitives/../../cuda4dnn/csl/cudnn.hpp:8,
> from /home/barkati/opencv/modules/dnn/src/layers/../cuda4dnn/primitives/../../op\_cuda.hpp:12,
> from /home/barkati/opencv/modules/dnn/src/layers/../cuda4dnn/primitives/recurrent\_cells.hpp:8,
> from /home/barkati/opencv/modules/dnn/src/layers/recurrent\_layers.cpp:49:
> /home/barkati/opencv/modules/dnn/src/layers/../cuda4dnn/primitives/../csl/cudnn/recurrent.hpp: In instantiation of ‘cv::dnn::cuda4dnn::csl::cudnn::RNNDescriptor\<T\>::RNNDescriptor(const cv::dnn::cuda4dnn::csl::cudnn::Handle&, cv::dnn::cuda4dnn::csl::cudnn::RNNDescriptor\<T\>::RNNMode, int, int, bool, const cv::dnn::cuda4dnn::csl::cudnn::DropoutDescriptor&) \[with T = \_\_half\]’:
> /home/barkati/opencv/modules/dnn/src/layers/../cuda4dnn/primitives/../csl/tensor\_ops.hpp:541:23: required from ‘cv::dnn::cuda4dnn::csl::LSTM\<T\>::LSTM(cv::dnn::cuda4dnn::csl::cudnn::Handle, const cv::dnn::cuda4dnn::csl::LSTM\<T\>::params\_type&) \[with T = \_\_half\]’
> /home/barkati/opencv/modules/dnn/src/layers/../cuda4dnn/primitives/recurrent\_cells.hpp:48:21: required from ‘cv::dnn::cuda4dnn::LSTMOp\<T\>::LSTMOp(cv::dnn::cuda4dnn::csl::Stream, cv::dnn::cuda4dnn::csl::cudnn::Handle, const cv::Mat&, const cv::Mat&, const cv::Mat&, const cv::dnn::cuda4dnn::RNNConfiguration&) \[with T = \_\_half\]’
> /home/barkati/opencv/modules/dnn/src/layers/../cuda4dnn/primitives/../../op\_cuda.hpp:194:37: required from ‘cv::Ptr\<cv::dnn::dnn4\_v20231225::BackendNode\> cv::dnn::make\_cuda\_node(int, Args&& ...) \[with NodeType = cv::dnn::cuda4dnn::LSTMOp; Args = {cv::dnn::cuda4dnn::csl::Stream, cv::dnn::cuda4dnn::csl::cudnn::Handle, cv::Mat&, cv::Mat&, cv::Mat&, cv::dnn::cuda4dnn::RNNConfiguration&}\]’
> /home/barkati/opencv/modules/dnn/src/layers/recurrent\_layers.cpp:766:55: required from here
> /home/barkati/opencv/modules/dnn/src/layers/../cuda4dnn/primitives/../csl/cudnn/recurrent.hpp:122:58: error: ‘cudnnSetRNNDescriptor\_v6’ was not declared in this scope; did you mean ‘cudnnSetRNNDescriptor\_v8’?
> 122 | CUDA4DNN\_CHECK\_CUDNN(cudnnSetRNNDescriptor\_v6(
> /home/barkati/opencv/modules/dnn/src/layers/../cuda4dnn/primitives/../../cuda4dnn/csl/cudnn/cudnn.hpp:22:53: note: in definition of macro ‘CUDA4DNN\_CHECK\_CUDNN’
> 22 | ::cv::dnn::cuda4dnn::csl::cudnn::detail::check((call), CV\_Func, \_\_FILE\_\_, \_\_LINE\_\_)
> | ^~~~
> /home/barkati/opencv/modules/dnn/src/layers/../cuda4dnn/primitives/../csl/cudnn/recurrent.hpp: In instantiation of ‘size\_t cv::dnn::cuda4dnn::csl::cudnn::getRNNWorkspaceSize(const cv::dnn::cuda4dnn::csl::cudnn::Handle&, const cv::dnn::cuda4dnn::csl::cudnn::RNNDescriptor\<T\>&, int, const cv::dnn::cuda4dnn::csl::cudnn::TensorDescriptorsArray\<T\>&) \[with T = \_\_half; size\_t = long unsigned int\]’:
> /home/barkati/opencv/modules/dnn/src/layers/../cuda4dnn/primitives/../csl/tensor\_ops.hpp:553:58: required from ‘cv::dnn::cuda4dnn::csl::LSTM\<T\>::LSTM(cv::dnn::cuda4dnn::csl::cudnn::Handle, const cv::dnn::cuda4dnn::csl::LSTM\<T\>::params\_type&) \[with T = \_\_half\]’
> /home/barkati/opencv/modules/dnn/src/layers/../cuda4dnn/primitives/recurrent\_cells.hpp:48:21: required from ‘cv::dnn::cuda4dnn::LSTMOp\<T\>::LSTMOp(cv::dnn::cuda4dnn::csl::Stream, cv::dnn::cuda4dnn::csl::cudnn::Handle, const cv::Mat&, const cv::Mat&, const cv::Mat&, const cv::dnn::cuda4dnn::RNNConfiguration&) \[with T = \_\_half\]’
> /home/barkati/opencv/modules/dnn/src/layers/../cuda4dnn/primitives/../../op\_cuda.hpp:194:37: required from ‘cv::Ptr\<cv::dnn::dnn4\_v20231225::BackendNode\> cv::dnn::make\_cuda\_node(int, Args&& ...) \[with NodeType = cv::dnn::cuda4dnn::LSTMOp; Args = {cv::dnn::cuda4dnn::csl::Stream, cv::dnn::cuda4dnn::csl::cudnn::Handle, cv::Mat&, cv::Mat&, cv::Mat&, cv::dnn::cuda4dnn::RNNConfiguration&}\]’
> /home/barkati/opencv/modules/dnn/src/layers/recurrent\_layers.cpp:766:55: required from here
> /home/barkati/opencv/modules/dnn/src/layers/../cuda4dnn/primitives/../csl/cudnn/recurrent.hpp:166:50: error: ‘cudnnGetRNNWorkspaceSize’ was not declared in this scope; did you mean ‘cudnnGetRNNWeightSpaceSize’?
> 166 | CUDA4DNN\_CHECK\_CUDNN(cudnnGetRNNWorkspaceSize(handle.get(), rnnDesc.get(), seqLength,
> /home/barkati/opencv/modules/dnn/src/layers/../cuda4dnn/primitives/../../cuda4dnn/csl/cudnn/cudnn.hpp:22:53: note: in definition of macro ‘CUDA4DNN\_CHECK\_CUDNN’
> 22 | ::cv::dnn::cuda4dnn::csl::cudnn::detail::check((call), CV\_Func, \_\_FILE\_\_, \_\_LINE\_\_)
> | ^~~~
> /home/barkati/opencv/modules/dnn/src/layers/../cuda4dnn/primitives/../csl/cudnn/recurrent.hpp: In instantiation of ‘cv::dnn::cuda4dnn::csl::cudnn::RNNDescriptor\<T\>::RNNDescriptor(const cv::dnn::cuda4dnn::csl::cudnn::Handle&, cv::dnn::cuda4dnn::csl::cudnn::RNNDescriptor\<T\>::RNNMode, int, int, bool, const cv::dnn::cuda4dnn::csl::cudnn::DropoutDescriptor&) \[with T = float\]’:
> /home/barkati/opencv/modules/dnn/src/layers/../cuda4dnn/primitives/../csl/tensor\_ops.hpp:541:23: required from ‘cv::dnn::cuda4dnn::csl::LSTM\<T\>::LSTM(cv::dnn::cuda4dnn::csl::cudnn::Handle, const cv::dnn::cuda4dnn::csl::LSTM\<T\>::params\_type&) \[with T = float\]’
> /home/barkati/opencv/modules/dnn/src/layers/../cuda4dnn/primitives/recurrent\_cells.hpp:48:21: required from ‘cv::dnn::cuda4dnn::LSTMOp\<T\>::LSTMOp(cv::dnn::cuda4dnn::csl::Stream, cv::dnn::cuda4dnn::csl::cudnn::Handle, const cv::Mat&, const cv::Mat&, const cv::Mat&, const cv::dnn::cuda4dnn::RNNConfiguration&) \[with T = float\]’
> /home/barkati/opencv/modules/dnn/src/layers/../cuda4dnn/primitives/../../op\_cuda.hpp:196:37: required from ‘cv::Ptr\<cv::dnn::dnn4\_v20231225::BackendNode\> cv::dnn::make\_cuda\_node(int, Args&& ...) \[with NodeType = cv::dnn::cuda4dnn::LSTMOp; Args = {cv::dnn::cuda4dnn::csl::Stream, cv::dnn::cuda4dnn::csl::cudnn::Handle, cv::Mat&, cv::Mat&, cv::Mat&, cv::dnn::cuda4dnn::RNNConfiguration&}\]’
> /home/barkati/opencv/modules/dnn/src/layers/recurrent\_layers.cpp:766:55: required from here
> /home/barkati/opencv/modules/dnn/src/layers/../cuda4dnn/primitives/../csl/cudnn/recurrent.hpp:122:58: error: ‘cudnnSetRNNDescriptor\_v6’ was not declared in this scope; did you mean ‘cudnnSetRNNDescriptor\_v8’?
> 122 | CUDA4DNN\_CHECK\_CUDNN(cudnnSetRNNDescriptor\_v6(
> /home/barkati/opencv/modules/dnn/src/layers/../cuda4dnn/primitives/../../cuda4dnn/csl/cudnn/cudnn.hpp:22:53: note: in definition of macro ‘CUDA4DNN\_CHECK\_CUDNN’
> 22 | ::cv::dnn::cuda4dnn::csl::cudnn::detail::check((call), CV\_Func, \_\_FILE\_\_, \_\_LINE\_\_)
> | ^~~~
> /home/barkati/opencv/modules/dnn/src/layers/../cuda4dnn/primitives/../csl/cudnn/recurrent.hpp: In instantiation of ‘size\_t cv::dnn::cuda4dnn::csl::cudnn::getRNNWorkspaceSize(const cv::dnn::cuda4dnn::csl::cudnn::Handle&, const cv::dnn::cuda4dnn::csl::cudnn::RNNDescriptor\<T\>&, int, const cv::dnn::cuda4dnn::csl::cudnn::TensorDescriptorsArray\<T\>&) \[with T = float; size\_t = long unsigned int\]’:
> /home/barkati/opencv/modules/dnn/src/layers/../cuda4dnn/primitives/../csl/tensor\_ops.hpp:553:58: required from ‘cv::dnn::cuda4dnn::csl::LSTM\<T\>::LSTM(cv::dnn::cuda4dnn::csl::cudnn::Handle, const cv::dnn::cuda4dnn::csl::LSTM\<T\>::params\_type&) \[with T = float\]’
> /home/barkati/opencv/modules/dnn/src/layers/../cuda4dnn/primitives/recurrent\_cells.hpp:48:21: required from ‘cv::dnn::cuda4dnn::LSTMOp\<T\>::LSTMOp(cv::dnn::cuda4dnn::csl::Stream, cv::dnn::cuda4dnn::csl::cudnn::Handle, const cv::Mat&, const cv::Mat&, const cv::Mat&, const cv::dnn::cuda4dnn::RNNConfiguration&) \[with T = float\]’
> /home/barkati/opencv/modules/dnn/src/layers/../cuda4dnn/primitives/../../op\_cuda.hpp:196:37: required from ‘cv::Ptr\<cv::dnn::dnn4\_v20231225::BackendNode\> cv::dnn::make\_cuda\_node(int, Args&& ...) \[with NodeType = cv::dnn::cuda4dnn::LSTMOp; Args = {cv::dnn::cuda4dnn::csl::Stream, cv::dnn::cuda4dnn::csl::cudnn::Handle, cv::Mat&, cv::Mat&, cv::Mat&, cv::dnn::cuda4dnn::RNNConfiguration&}\]’
> /home/barkati/opencv/modules/dnn/src/layers/recurrent\_layers.cpp:766:55: required from here
> /home/barkati/opencv/modules/dnn/src/layers/../cuda4dnn/primitives/../csl/cudnn/recurrent.hpp:166:50: error: ‘cudnnGetRNNWorkspaceSize’ was not declared in this scope; did you mean ‘cudnnGetRNNWeightSpaceSize’?
> 166 | CUDA4DNN\_CHECK\_CUDNN(cudnnGetRNNWorkspaceSize(handle.get(), rnnDesc.get(), seqLength,
> /home/barkati/opencv/modules/dnn/src/layers/../cuda4dnn/primitives/../../cuda4dnn/csl/cudnn/cudnn.hpp:22:53: note: in definition of macro ‘CUDA4DNN\_CHECK\_CUDNN’
> 22 | ::cv::dnn::cuda4dnn::csl::cudnn::detail::check((call), CV\_Func, \_\_FILE\_\_, \_\_LINE\_\_)
> | ^~~~
> /home/barkati/opencv/modules/dnn/src/layers/../cuda4dnn/primitives/../csl/cudnn/recurrent.hpp: In instantiation of ‘void cv::dnn::cuda4dnn::csl::cudnn::LSTMForward(const cv::dnn::cuda4dnn::csl::cudnn::Handle&, const cv::dnn::cuda4dnn::csl::cudnn::RNNDescriptor\<T\>&, const cv::dnn::cuda4dnn::csl::cudnn::FilterDescriptor\<T\>&, cv::dnn::cuda4dnn::csl::DevicePtr\<const T\>, const cv::dnn::cuda4dnn::csl::cudnn::TensorDescriptorsArray\<T\>&, cv::dnn::cuda4dnn::csl::DevicePtr\<const T\>, const cv::dnn::cuda4dnn::csl::cudnn::TensorDescriptor\<T\>&, cv::dnn::cuda4dnn::csl::DevicePtr\<const T\>, const cv::dnn::cuda4dnn::csl::cudnn::TensorDescriptor\<T\>&, cv::dnn::cuda4dnn::csl::DevicePtr\<const T\>, int, const cv::dnn::cuda4dnn::csl::cudnn::TensorDescriptorsArray\<T\>&, cv::dnn::cuda4dnn::csl::DevicePtr\<T\>, cv::dnn::cuda4dnn::csl::DevicePtr\<T\>, cv::dnn::cuda4dnn::csl::WorkspaceInstance) \[with T = float\]’:
> /home/barkati/opencv/modules/dnn/src/layers/../cuda4dnn/primitives/../csl/tensor\_ops.hpp:563:34: required from ‘void cv::dnn::cuda4dnn::csl::LSTM\<T\>::inference(cv::dnn::cuda4dnn::csl::TensorView\<T\>, cv::dnn::cuda4dnn::csl::TensorSpan\<T\>, cv::dnn::cuda4dnn::csl::TensorSpan\<T\>, cv::dnn::cuda4dnn::csl::TensorView\<T\>, cv::dnn::cuda4dnn::csl::TensorView\<T\>, cv::dnn::cuda4dnn::csl::TensorView\<T\>, cv::dnn::cuda4dnn::csl::WorkspaceInstance) \[with T = float\]’
> /home/barkati/opencv/modules/dnn/src/layers/../cuda4dnn/primitives/recurrent\_cells.hpp:79:9: required from ‘void cv::dnn::cuda4dnn::LSTMOp\<T\>::forward(const std::vector\<cv::Ptr\<cv::dnn::dnn4\_v20231225::BackendWrapper\> \>&, const std::vector\<cv::Ptr\<cv::dnn::dnn4\_v20231225::BackendWrapper\> \>&, cv::dnn::cuda4dnn::csl::Workspace&) \[with T = float\]’
> /home/barkati/opencv/modules/dnn/src/layers/../cuda4dnn/primitives/recurrent\_cells.hpp:63:10: required from here
> /home/barkati/opencv/modules/dnn/src/layers/../cuda4dnn/primitives/../csl/cudnn/recurrent.hpp:182:50: error: ‘cudnnRNNForwardInference’ was not declared in this scope
> 182 | CUDA4DNN\_CHECK\_CUDNN(cudnnRNNForwardInference(handle.get(), rnnDesc.get(), seqLength,
> /home/barkati/opencv/modules/dnn/src/layers/../cuda4dnn/primitives/../../cuda4dnn/csl/cudnn/cudnn.hpp:22:53: note: in definition of macro ‘CUDA4DNN\_CHECK\_CUDNN’
> 22 | ::cv::dnn::cuda4dnn::csl::cudnn::detail::check((call), CV\_Func, \_\_FILE\_\_, \_\_LINE\_\_)
> | ^~~~
> /home/barkati/opencv/modules/dnn/src/layers/../cuda4dnn/primitives/../csl/cudnn/recurrent.hpp: In instantiation of ‘void cv::dnn::cuda4dnn::csl::cudnn::LSTMForward(const cv::dnn::cuda4dnn::csl::cudnn::Handle&, const cv::dnn::cuda4dnn::csl::cudnn::RNNDescriptor\<T\>&, const cv::dnn::cuda4dnn::csl::cudnn::FilterDescriptor\<T\>&, cv::dnn::cuda4dnn::csl::DevicePtr\<const T\>, const cv::dnn::cuda4dnn::csl::cudnn::TensorDescriptorsArray\<T\>&, cv::dnn::cuda4dnn::csl::DevicePtr\<const T\>, const cv::dnn::cuda4dnn::csl::cudnn::TensorDescriptor\<T\>&, cv::dnn::cuda4dnn::csl::DevicePtr\<const T\>, const cv::dnn::cuda4dnn::csl::cudnn::TensorDescriptor\<T\>&, cv::dnn::cuda4dnn::csl::DevicePtr\<const T\>, int, const cv::dnn::cuda4dnn::csl::cudnn::TensorDescriptorsArray\<T\>&, cv::dnn::cuda4dnn::csl::DevicePtr\<T\>, cv::dnn::cuda4dnn::csl::DevicePtr\<T\>, cv::dnn::cuda4dnn::csl::WorkspaceInstance) \[with T = \_\_half\]’:
> /home/barkati/opencv/modules/dnn/src/layers/../cuda4dnn/primitives/../csl/tensor\_ops.hpp:563:34: required from ‘void cv::dnn::cuda4dnn::csl::LSTM\<T\>::inference(cv::dnn::cuda4dnn::csl::TensorView\<T\>, cv::dnn::cuda4dnn::csl::TensorSpan\<T\>, cv::dnn::cuda4dnn::csl::TensorSpan\<T\>, cv::dnn::cuda4dnn::csl::TensorView\<T\>, cv::dnn::cuda4dnn::csl::TensorView\<T\>, cv::dnn::cuda4dnn::csl::TensorView\<T\>, cv::dnn::cuda4dnn::csl::WorkspaceInstance) \[with T = \_\_half\]’
> /home/barkati/opencv/modules/dnn/src/layers/../cuda4dnn/primitives/recurrent\_cells.hpp:79:9: required from ‘void cv::dnn::cuda4dnn::LSTMOp\<T\>::forward(const std::vector\<cv::Ptr\<cv::dnn::dnn4\_v20231225::BackendWrapper\> \>&, const std::vector\<cv::Ptr\<cv::dnn::dnn4\_v20231225::BackendWrapper\> \>&, cv::dnn::cuda4dnn::csl::Workspace&) \[with T = \_\_half\]’
> /home/barkati/opencv/modules/dnn/src/layers/../cuda4dnn/primitives/recurrent\_cells.hpp:63:10: required from here
> /home/barkati/opencv/modules/dnn/src/layers/../cuda4dnn/primitives/../csl/cudnn/recurrent.hpp:182:50: error: ‘cudnnRNNForwardInference’ was not declared in this scope
> 182 | CUDA4DNN\_CHECK\_CUDNN(cudnnRNNForwardInference(handle.get(), rnnDesc.get(), seqLength,
> /home/barkati/opencv/modules/dnn/src/layers/../cuda4dnn/primitives/../../cuda4dnn/csl/cudnn/cudnn.hpp:22:53: note: in definition of macro ‘CUDA4DNN\_CHECK\_CUDNN’
> 22 | ::cv::dnn::cuda4dnn::csl::cudnn::detail::check((call), CV\_Func, \_\_FILE\_\_, \_\_LINE\_\_)
> | ^~~~
> \[37%\] Building CXX object modules/core/CMakeFiles/opencv\_test\_core.dir/test/test\_intrin128.ssse3.cpp.o
> make\[2\]: \*\*\* \[modules/dnn/CMakeFiles/opencv\_dnn.dir/build.make:1320 : modules/dnn/CMakeFiles/opencv\_dnn.dir/src/layers/recurrent\_layers.cpp.o\] Erreur 1
> make\[2\]: \*\*\* Attente des tâches non terminées....
> \[37%\] Building CXX object modules/imgproc/CMakeFiles/opencv\_test\_imgproc.dir/test/test\_emd.cpp.o
> \[37%\] Building NVCC (Device) object modules/cudafilters/CMakeFiles/cuda\_compile\_1.dir/src/cuda/cuda\_compile\_1\_generated\_column\_filter.16uc4.cu.o
> \[37%\] Building CXX object modules/features2d/CMakeFiles/opencv\_test\_features2d.dir/test/test\_brisk.cpp.o
> \[37%\] Building CXX object modules/imgproc/CMakeFiles/opencv\_perf\_imgproc.dir/perf/perf\_spatialgradient.cpp.o
> \[37%\] Building CXX object modules/imgproc/CMakeFiles/opencv\_perf\_imgproc.dir/perf/perf\_threshold.cpp.o
> \[37%\] Building NVCC (Device) object modules/cudafilters/CMakeFiles/cuda\_compile\_1.dir/src/cuda/cuda\_compile\_1\_generated\_column\_filter.32fc1.cu.o
> \[37%\] Building CXX object modules/features2d/CMakeFiles/opencv\_test\_features2d.dir/test/test\_descriptors\_invariance.cpp.o
> \[37%\] Building CXX object modules/imgproc/CMakeFiles/opencv\_perf\_imgproc.dir/perf/perf\_warp.cpp.o
> \[37%\] Building CXX object modules/imgproc/CMakeFiles/opencv\_test\_imgproc.dir/test/test\_filter.cpp.o
> make\[1\]: \*\*\* \[CMakeFiles/Makefile2:7898 : modules/dnn/CMakeFiles/opencv\_dnn.dir/all\] Erreur 2
> make\[1\]: \*\*\* Attente des tâches non terminées....
> \[37%\] Building CXX object modules/imgproc/CMakeFiles/opencv\_test\_imgproc.dir/test/test\_fitellipse.cpp.o
> \[37%\] Building CXX object modules/core/CMakeFiles/opencv\_test\_core.dir/test/test\_intrin128.sse4\_1.cpp.o
> \[37%\] Building CXX object modules/features2d/CMakeFiles/opencv\_test\_features2d.dir/test/test\_descriptors\_regression.cpp.o
> \[37%\] Building CXX object modules/imgproc/CMakeFiles/opencv\_test\_imgproc.dir/test/test\_fitellipse\_ams.cpp.o
> \[37%\] Linking CXX executable ../../bin/opencv\_perf\_imgproc
> \[37%\] Built target opencv\_perf\_imgproc
> \[37%\] Building CXX object modules/core/CMakeFiles/opencv\_test\_core.dir/test/test\_intrin128.sse4\_2.cpp.o
> \[37%\] Building CXX object modules/imgproc/CMakeFiles/opencv\_test\_imgproc.dir/test/test\_fitellipse\_direct.cpp.o
> \[37%\] Building CXX object modules/features2d/CMakeFiles/opencv\_test\_features2d.dir/test/test\_detectors\_invariance.cpp.o
> \[37%\] Building CXX object modules/imgproc/CMakeFiles/opencv\_test\_imgproc.dir/test/test\_floodfill.cpp.o
> \[37%\] Building CXX object modules/imgproc/CMakeFiles/opencv\_test\_imgproc.dir/test/test\_goodfeaturetotrack.cpp.o
> \[37%\] Building CXX object modules/core/CMakeFiles/opencv\_test\_core.dir/test/test\_intrin128.fp16.cpp.o
> \[37%\] Building CXX object modules/features2d/CMakeFiles/opencv\_test\_features2d.dir/test/test\_detectors\_regression.cpp.o
> \[37%\] Building CXX object modules/features2d/CMakeFiles/opencv\_test\_features2d.dir/test/test\_drawing.cpp.o
> \[37%\] Building CXX object modules/imgproc/CMakeFiles/opencv\_test\_imgproc.dir/test/test\_grabcut.cpp.o
> \[37%\] Building CXX object modules/features2d/CMakeFiles/opencv\_test\_features2d.dir/test/test\_fast.cpp.o
> \[37%\] Building CXX object modules/imgproc/CMakeFiles/opencv\_test\_imgproc.dir/test/test\_histograms.cpp.o
> \[37%\] Building CXX object modules/features2d/CMakeFiles/opencv\_test\_features2d.dir/test/test\_keypoints.cpp.o
> \[37%\] Building CXX object modules/core/CMakeFiles/opencv\_test\_core.dir/test/test\_intrin128.avx.cpp.o
> \[37%\] Building CXX object modules/features2d/CMakeFiles/opencv\_test\_features2d.dir/test/test\_main.cpp.o
> \[37%\] Building CXX object modules/features2d/CMakeFiles/opencv\_test\_features2d.dir/test/test\_matchers\_algorithmic.cpp.o
> \[37%\] Building CXX object modules/features2d/CMakeFiles/opencv\_test\_features2d.dir/test/test\_mser.cpp.o
> \[37%\] Building CXX object modules/features2d/CMakeFiles/opencv\_test\_features2d.dir/test/test\_nearestneighbors.cpp.o
> \[37%\] Building CXX object modules/imgproc/CMakeFiles/opencv\_test\_imgproc.dir/test/test\_houghcircles.cpp.o
> \[38%\] Building CXX object modules/features2d/CMakeFiles/opencv\_test\_features2d.dir/test/test\_orb.cpp.o
> \[38%\] Building CXX object modules/core/CMakeFiles/opencv\_test\_core.dir/test/test\_intrin128.avx2.cpp.o
> \[38%\] Building CXX object modules/features2d/CMakeFiles/opencv\_test\_features2d.dir/test/test\_sift.cpp.o
> \[38%\] Building CXX object modules/features2d/CMakeFiles/opencv\_test\_features2d.dir/test/test\_utils.cpp.o
> \[38%\] Building CXX object modules/core/CMakeFiles/opencv\_test\_core.dir/test/test\_intrin256.avx2.cpp.o
> \[38%\] Linking CXX executable ../../bin/opencv\_test\_features2d
> \[38%\] Built target opencv\_test\_features2d
> \[38%\] Building CXX object modules/core/CMakeFiles/opencv\_test\_core.dir/test/test\_intrin128.avx512\_skx.cpp.o
> \[38%\] Building CXX object modules/imgproc/CMakeFiles/opencv\_test\_imgproc.dir/test/test\_houghlines.cpp.o
> \[39%\] Building CXX object modules/core/CMakeFiles/opencv\_test\_core.dir/test/test\_intrin256.avx512\_skx.cpp.o
> Scanning dependencies of target opencv\_test\_cudev
> \[39%\] Building CXX object modules/cudev/test/CMakeFiles/opencv\_test\_cudev.dir/test\_main.cpp.o
> \[39%\] Linking CXX executable ../../../bin/opencv\_test\_cudev
> \[39%\] Built target opencv\_test\_cudev
> \[39%\] Building CXX object modules/core/CMakeFiles/opencv\_test\_core.dir/test/test\_intrin512.avx512\_skx.cpp.o
> \[39%\] Building CXX object modules/imgproc/CMakeFiles/opencv\_test\_imgproc.dir/test/test\_imgproc\_umat.cpp.o
> \[39%\] Building CXX object modules/imgproc/CMakeFiles/opencv\_test\_imgproc.dir/test/test\_imgwarp.cpp.o
> \[39%\] Building CXX object modules/imgproc/CMakeFiles/opencv\_test\_imgproc.dir/test/test\_imgwarp\_strict.cpp.o
> \[39%\] Building CXX object modules/imgproc/CMakeFiles/opencv\_test\_imgproc.dir/test/test\_intelligent\_scissors.cpp.o
> \[39%\] Building CXX object modules/imgproc/CMakeFiles/opencv\_test\_imgproc.dir/test/test\_intersectconvexconvex.cpp.o
> \[40%\] Building CXX object modules/imgproc/CMakeFiles/opencv\_test\_imgproc.dir/test/test\_intersection.cpp.o
> \[40%\] Building CXX object modules/imgproc/CMakeFiles/opencv\_test\_imgproc.dir/test/test\_lsd.cpp.o
> \[40%\] Building CXX object modules/imgproc/CMakeFiles/opencv\_test\_imgproc.dir/test/test\_main.cpp.o
> \[40%\] Building CXX object modules/imgproc/CMakeFiles/opencv\_test\_imgproc.dir/test/test\_moments.cpp.o
> \[40%\] Building CXX object modules/imgproc/CMakeFiles/opencv\_test\_imgproc.dir/test/test\_pc.cpp.o
> \[40%\] Building CXX object modules/imgproc/CMakeFiles/opencv\_test\_imgproc.dir/test/test\_pyramid.cpp.o
> \[40%\] Building CXX object modules/imgproc/CMakeFiles/opencv\_test\_imgproc.dir/test/test\_resize\_bitexact.cpp.o
> \[40%\] Building CXX object modules/imgproc/CMakeFiles/opencv\_test\_imgproc.dir/test/test\_smooth\_bitexact.cpp.o
> \[40%\] Building CXX object modules/imgproc/CMakeFiles/opencv\_test\_imgproc.dir/test/test\_stackblur.cpp.o
> \[40%\] Building CXX object modules/imgproc/CMakeFiles/opencv\_test\_imgproc.dir/test/test\_subdivision2d.cpp.o
> \[40%\] Building CXX object modules/imgproc/CMakeFiles/opencv\_test\_imgproc.dir/test/test\_templmatch.cpp.o
> \[40%\] Building CXX object modules/imgproc/CMakeFiles/opencv\_test\_imgproc.dir/test/test\_templmatchmask.cpp.o
> \[40%\] Building CXX object modules/imgproc/CMakeFiles/opencv\_test\_imgproc.dir/test/test\_thresh.cpp.o
> \[40%\] Building CXX object modules/imgproc/CMakeFiles/opencv\_test\_imgproc.dir/test/test\_watershed.cpp.o
> \[40%\] Building NVCC (Device) object modules/cudafilters/CMakeFiles/cuda\_compile\_1.dir/src/cuda/cuda\_compile\_1\_generated\_column\_filter.32fc3.cu.o
> \[40%\] Building NVCC (Device) object modules/cudafilters/CMakeFiles/cuda\_compile\_1.dir/src/cuda/cuda\_compile\_1\_generated\_column\_filter.32fc4.cu.o
> \[40%\] Building NVCC (Device) object modules/cudafilters/CMakeFiles/cuda\_compile\_1.dir/src/cuda/cuda\_compile\_1\_generated\_column\_filter.32sc1.cu.o
> \[40%\] Building NVCC (Device) object modules/cudafilters/CMakeFiles/cuda\_compile\_1.dir/src/cuda/cuda\_compile\_1\_generated\_column\_filter.32sc3.cu.o
> \[40%\] Building NVCC (Device) object modules/cudafilters/CMakeFiles/cuda\_compile\_1.dir/src/cuda/cuda\_compile\_1\_generated\_column\_filter.32sc4.cu.o
> \[40%\] Building NVCC (Device) object modules/cudafilters/CMakeFiles/cuda\_compile\_1.dir/src/cuda/cuda\_compile\_1\_generated\_column\_filter.8uc1.cu.o
> \[40%\] Linking CXX executable ../../bin/opencv\_test\_imgproc
> \[40%\] Linking CXX executable ../../bin/opencv\_test\_core
> \[40%\] Built target opencv\_test\_imgproc
> \[40%\] Building NVCC (Device) object modules/cudafilters/CMakeFiles/cuda\_compile\_1.dir/src/cuda/cuda\_compile\_1\_generated\_column\_filter.8uc3.cu.o
> \[40%\] Built target opencv\_test\_core
> \[40%\] Building NVCC (Device) object modules/cudafilters/CMakeFiles/cuda\_compile\_1.dir/src/cuda/cuda\_compile\_1\_generated\_column\_filter.8uc4.cu.o
> \[40%\] Building NVCC (Device) object modules/cudafilters/CMakeFiles/cuda\_compile\_1.dir/src/cuda/cuda\_compile\_1\_generated\_filter2d.cu.o
> \[40%\] Building NVCC (Device) object modules/cudafilters/CMakeFiles/cuda\_compile\_1.dir/src/cuda/cuda\_compile\_1\_generated\_median\_filter.cu.o
> \[40%\] Building NVCC (Device) object modules/cudafilters/CMakeFiles/cuda\_compile\_1.dir/src/cuda/cuda\_compile\_1\_generated\_row\_filter.16sc1.cu.o
> \[40%\] Building NVCC (Device) object modules/cudafilters/CMakeFiles/cuda\_compile\_1.dir/src/cuda/cuda\_compile\_1\_generated\_row\_filter.16sc3.cu.o
> \[40%\] Building NVCC (Device) object modules/cudafilters/CMakeFiles/cuda\_compile\_1.dir/src/cuda/cuda\_compile\_1\_generated\_row\_filter.16sc4.cu.o
> \[40%\] Building NVCC (Device) object modules/cudafilters/CMakeFiles/cuda\_compile\_1.dir/src/cuda/cuda\_compile\_1\_generated\_row\_filter.16uc1.cu.o
> \[40%\] Building NVCC (Device) object modules/cudafilters/CMakeFiles/cuda\_compile\_1.dir/src/cuda/cuda\_compile\_1\_generated\_row\_filter.16uc3.cu.o
> \[40%\] Building NVCC (Device) object modules/cudafilters/CMakeFiles/cuda\_compile\_1.dir/src/cuda/cuda\_compile\_1\_generated\_row\_filter.16uc4.cu.o
> \[40%\] Building NVCC (Device) object modules/cudafilters/CMakeFiles/cuda\_compile\_1.dir/src/cuda/cuda\_compile\_1\_generated\_row\_filter.32fc1.cu.o
> \[40%\] Building NVCC (Device) object modules/cudafilters/CMakeFiles/cuda\_compile\_1.dir/src/cuda/cuda\_compile\_1\_generated\_row\_filter.32fc3.cu.o
> \[40%\] Building NVCC (Device) object modules/cudafilters/CMakeFiles/cuda\_compile\_1.dir/src/cuda/cuda\_compile\_1\_generated\_row\_filter.32fc4.cu.o
> \[40%\] Building NVCC (Device) object modules/cudafilters/CMakeFiles/cuda\_compile\_1.dir/src/cuda/cuda\_compile\_1\_generated\_row\_filter.32sc1.cu.o
> \[40%\] Building NVCC (Device) object modules/cudafilters/CMakeFiles/cuda\_compile\_1.dir/src/cuda/cuda\_compile\_1\_generated\_row\_filter.32sc3.cu.o
> \[40%\] Building NVCC (Device) object modules/cudafilters/CMakeFiles/cuda\_compile\_1.dir/src/cuda/cuda\_compile\_1\_generated\_row\_filter.32sc4.cu.o
> \[40%\] Building NVCC (Device) object modules/cudafilters/CMakeFiles/cuda\_compile\_1.dir/src/cuda/cuda\_compile\_1\_generated\_row\_filter.8uc1.cu.o
> \[40%\] Building NVCC (Device) object modules/cudafilters/CMakeFiles/cuda\_compile\_1.dir/src/cuda/cuda\_compile\_1\_generated\_row\_filter.8uc3.cu.o
> Scanning dependencies of target opencv\_cudafilters
> \[40%\] Building CXX object modules/cudafilters/CMakeFiles/opencv\_cudafilters.dir/src/filtering.cpp.o
> \[40%\] Linking CXX shared library ../../lib/libopencv\_cudafilters.so
> \[40%\] Built target opencv\_cudafilters
> make: \*\*\* \[Makefile:163 : all\] Erreur 2
> 
> 
> \### Steps to reproduce
> 
> \[Opencv cuda.txt\](https://github.com/opencv/opencv/files/15040205/Opencv.cuda.txt)
> 
> 
> \### Issue submission checklist
> 
> \- \[X\] I report the issue, it's not a question
> \- \[X\] I checked the problem with documentation, FAQ, open issues, forum.opencv.org, Stack Overflow, etc and have not found any solution
> \- \[X\] I updated to the latest OpenCV version and the issue is still there
> \- \[\] There is reproducer code and related data files (videos, images, onnx, etc)

---

<div class="post-metadata">

**Author:** ![BirdingPix](https://avatars.discourse-cdn.com/v4/letter/b/97f17d/32.png) [@BirdingPix](https://forum.opencv.org/u/BirdingPix)\
**Post date:** [April 26, 2024, 4:58pm UTC](https://forum.opencv.org/t/cmake-build-fail-opencv-4-9-0-cuda-12-4-cudnn-9-1-0-gcc-11-4/17424/3 "2024-04-26T16:58:28Z")

</div>

Thanks for this update… so it seems I need to down-revision CUDA to 12.3 and cuDNN to 8.9.7.

I successfully removed CUDA 12.4 and installed CUDA 12.3.

However, after many tries to install cuDNN 8.9.7 from the archive,  
( [cuDNN Archive | NVIDIA Developer](https://developer.nvidia.com/rdp/cudnn-archive))… I think I am giving up.

I downloaded cudnn-local-repo-ubuntu2204-8.9.7.29\_1.0-1\_amd64.deb

Then installing with this command:  
dk@ASUS:~$ sudo dpkg -D2 -i cudnn-local-repo-ubuntu2204-8.9.7.29\_1.0-1\_amd64.deb

This is the output:

> (Reading database … 231272 files and directories currently installed.)  
> Preparing to unpack cudnn-local-repo-ubuntu2204-8.9.7.29\_1.0-1\_amd64.deb …  
> D000002: maintscript\_fallback nonexistent prerm ‘/var/lib/dpkg/info/cudnn-local-repo-ubuntu2204-8.9.7.29.prerm’  
> D000002: maintscript\_new nonexistent preinst ‘/var/lib/dpkg/tmp.ci/preinst’  
> Unpacking cudnn-local-repo-ubuntu2204-8.9.7.29 (1.0-1) over (1.0-1) …  
> D000002: maintscript\_fallback nonexistent postrm ‘/var/lib/dpkg/info/cudnn-local-repo-ubuntu2204-8.9.7.29.postrm’  
> D000002: process\_archive info installed /var/lib/dpkg/tmp.ci/conffiles as /var/lib/dpkg/info/cudnn-local-repo-ubuntu2204-8.9.7.29.conffiles  
> D000002: process\_archive info installed /var/lib/dpkg/tmp.ci/md5sums as /var/lib/dpkg/info/cudnn-local-repo-ubuntu2204-8.9.7.29.md5sums  
> D000002: process\_archive info installed /var/lib/dpkg/tmp.ci/postinst as /var/lib/dpkg/info/cudnn-local-repo-ubuntu2204-8.9.7.29.postinst  
> D000002: process\_archive tmp.ci script/file ‘/var/lib/dpkg/tmp.ci/control’ is control  
> D000002: process\_archive tmp.ci script/file ‘…’ contains dot  
> D000002: process\_archive tmp.ci script/file ‘.’ contains dot  
> Setting up cudnn-local-repo-ubuntu2204-8.9.7.29 (1.0-1) …  
> D000002: fork/exec /var/lib/dpkg/info/cudnn-local-repo-ubuntu2204-8.9.7.29.postinst ( configure 1.0-1 )  
> dk@ASUS:~$

I have followed the post about renaming and copying GPG key to install this, and I have followed all these steps… and the key is there in there… but it still doesnt work.

 ![Screenshot 2024-04-26 at 11.57.16 AM](https://us1.discourse-cdn.com/flex020/uploads/opencv/original/2X/4/4894c11567137c879c25b19e31740c49a5ed6e1c.png)

I am about to give up.

---

<div class="post-metadata">

**Author:** ![BirdingPix](https://avatars.discourse-cdn.com/v4/letter/b/97f17d/32.png) [@BirdingPix](https://forum.opencv.org/u/BirdingPix)\
**Post date:** [April 26, 2024, 5:32pm UTC](https://forum.opencv.org/t/cmake-build-fail-opencv-4-9-0-cuda-12-4-cudnn-9-1-0-gcc-11-4/17424/4 "2024-04-26T17:32:37Z")

</div>

I decided to try with CUDNN=OFF and OPENCV\_DNN\_CUDA=OFF.

Here is my make script:

> dk@ASUS:~$ cat MAKE\_script\_for\_ASUS\_opencv490.sh  
> #!/usr/bin/env bash
> 
> # by DK April 2024
> 
> # ASUS-PC version
> 
> # JUST THE OPENCV MAKE portion
> 
> set -e # exit script immediately upon any error
> 
> CMAKEFLAGS="  
> -D ENABLE\_PRECOMPILED\_HEADERS=OFF  
> -D CMAKE\_BUILD\_TYPE=RELEASE  
> -D CMAKE\_INSTALL\_PREFIX=/usr/local  
> -D CMAKE\_PREFIX\_PATH=/usr/lib
> 
> ```
> -D OPENCV_EXTRA_MODULES_PATH=~/opencv490/opencv_contrib-4.9.0/modules
> -D BUILD_EXAMPLES=ON
> -D BUILD_TESTS=OFF
> -D BUILD_PERF_TESTS=OFF
> -D INSTALL_C_EXAMPLES=ON
> -D OPENCV_GENERATE_PKGCONFIG=ON
> 
> -D WITH_CUDA=ON
> -D WITH_CUDNN=OFF
> -D OPENCV_DNN_CUDA=OFF
> 
> -D WITH_CUBLAS=ON
> -D ENABLE_FAST_MATH=ON
> -D CUDA_FAST_MATH=ON
> -D WITH_OPENMP=ON
> -D WITH_OPENGL=ON
> -D WITH_FFMPEG=ON
> -D WITH_GSTREAMER=ON
> -D WITH_TBB=ON
> -D BUILD_TBB=ON
> 
> -D BUILD_NEW_PYTHON_SUPPORT=ON
> -D BUILD_opencv_python3=TRUE
> -D INSTALL_PYTHON_EXAMPLES=ON
> -D PYTHON_EXECUTABLE=~/.virtualenvs/cv/bin/python
> -D OPENCV_PYTHON3_INSTALL_PATH=~/.virtualenvs/cv/lib/python3.10/site-packages"
> 
> ```
> 
> cd ~/opencv490/opencv-4.9.0
> 
> mkdir build  
> cd build
> 
> echo “DK-INFO\>cmake flags: ${CMAKEFLAGS}”
> 
> cmake ${CMAKEFLAGS} …
> 
> echo “DK-INFO\>Make”  
> make -j24
> 
> echo “DK-INFO\>Make Install”  
> sudo make install
> 
> sudo ldconfig
> 
> echo "DK-INFO\>Done!

It got much further along… but still failed, even with DNN =OFF (see above).

Here is the 1st error.

 ![Screenshot 2024-04-26 at 12.20.37 PM](https://us1.discourse-cdn.com/flex020/uploads/opencv/original/2X/d/de4136d5aaa79d996f2e8ac10565e58363043e0c.jpeg)

Error 2:

> [78%] Building CXX object modules/cudalegacy/CMakeFiles/opencv\_cudalegacy.dir/src/gmg.cpp.o  
> [78%] Building CXX object modules/cudalegacy/CMakeFiles/opencv\_cudalegacy.dir/src/image\_pyramid.cpp.o  
> [78%] Building CXX object modules/cudalegacy/CMakeFiles/opencv\_cudalegacy.dir/src/graphcuts.cpp.o  
> [78%] Building CXX object modules/cudalegacy/CMakeFiles/opencv\_cudalegacy.dir/src/needle\_map.cpp.o  
> [78%] Building CXX object modules/cudalegacy/CMakeFiles/opencv\_cudalegacy.dir/src/interpolate\_frames.cpp.o  
> [78%] Linking CXX shared library …/…/lib/libopencv\_cudalegacy.so  
> [78%] Built target opencv\_cudalegacy  
> make: \*\*\* [Makefile:166: all] Error 2  
> dk@ASUS:~$

So now I really don’t know what to do next…  
Any help is much appreciated.

---

<div class="post-metadata">

**Author:** ![cudawarped](https://avatars.discourse-cdn.com/v4/letter/c/9dc877/32.png) [@cudawarped](https://forum.opencv.org/u/cudawarped)\
**Post date:** [April 26, 2024, 6:47pm UTC](https://forum.opencv.org/t/cmake-build-fail-opencv-4-9-0-cuda-12-4-cudnn-9-1-0-gcc-11-4/17424/5 "2024-04-26T18:47:23Z")

</div>

> [@BirdingPix](#):
>
> So now I really don’t know what to do next…

Use the latest commits from the 4.x branches. Your error was fixed in

> <https://github.com/opencv/opencv_contrib/pull/3717>
>
> fix #3711 by updating \*NVEncoder.cpp\* to reflect the changes contained in Nvidia…'s sample code.
> 
> \### Pull Request Readiness Checklist
> 
> See details at https://github.com/opencv/opencv/wiki/How\_to\_contribute#making-a-good-pull-request
> 
> \- \[x\] I agree to contribute to the project under Apache 2 License.
> \- \[x\] To the best of my knowledge, the proposed patch is not based on a code under GPL or another license that is incompatible with OpenCV
> \- \[x\] The PR is proposed to the proper branch
> \- \[x\] There is a reference to the original bug report and related work
> \- \[x\] There is accuracy test, performance test and test data in opencv\_extra repository, if applicable
> Patch to opencv\_extra has the same branch name.
> \- \[x\] The feature is well documented and sample code can be built with the project CMake

Regarding cuDNN just download the archive and extract to your CUDA directory don’t bother with the .deb.

---

<div class="post-metadata">

**Author:** ![BirdingPix](https://avatars.discourse-cdn.com/v4/letter/b/97f17d/32.png) [@BirdingPix](https://forum.opencv.org/u/BirdingPix)\
**Post date:** [April 26, 2024, 8:25pm UTC](https://forum.opencv.org/t/cmake-build-fail-opencv-4-9-0-cuda-12-4-cudnn-9-1-0-gcc-11-4/17424/6 "2024-04-26T20:25:02Z")

</div>

Thanks for your help. So, I just downloaded latest from

> **[GitHub - opencv/opencv: Open Source Computer Vision Library](https://github.com/opencv/opencv)**
>
> Open Source Computer Vision Library. Contribute to opencv/opencv development by creating an account on GitHub.

opencv-4.x.zip, opencv\_contrib-4.x.zip.

Unzipped, and updated my make script to this new folder. Keeping cuDNN still OFF.

It failed very quickly:

> In file included from /home/dk/opencv/opencv-4.x/build/3rdparty/tbb/oneTBB-2021.11.0/src/tbb/task\_dispatcher.h:24,  
> from /home/dk/opencv/opencv-4.x/build/3rdparty/tbb/oneTBB-2021.11.0/src/tbb/arena.cpp:17:  
> /home/dk/opencv/opencv-4.x/build/3rdparty/tbb/oneTBB-2021.11.0/src/tbb/scheduler\_common.h:248:16: note: called from here  
> 248 | \_tpause(0, time\_stamp + 1000);  
> | ~~~^~~~~~~~~~~~~~~~~~  
> make[2]: \*\*\* [3rdparty/tbb/CMakeFiles/tbb.dir/build.make:104: 3rdparty/tbb/CMakeFiles/tbb.dir/oneTBB-2021.11.0/src/tbb/arena.cpp.o] Error 1  
> make[2]: \*\*\* Waiting for unfinished jobs…  
> [3%] Building C object 3rdparty/libwebp/CMakeFiles/libwebp.dir/src/dec/io\_dec.c.o  
> [3%] Building C object 3rdparty/ippiw/CMakeFiles/ippiw.dir/src/iw\_image\_filter\_sobel.c.o  
> [3%] Building C object 3rdparty/openjpeg/openjp2/CMakeFiles/libopenjp2.dir/tgt.c.o  
> [3%] Building C object 3rdparty/ippiw/CMakeFiles/ippiw.dir/src/iw\_image\_op\_copy.c.o  
> [3%] Building CXX object CMakeFiles/ade.dir/3rdparty/ade/ade-0.1.2d/sources/ade/source/metatypes.cpp.o  
> [3%] Building C object 3rdparty/openjpeg/openjp2/CMakeFiles/libopenjp2.dir/function\_list.c.o  
> [3%] Building C object 3rdparty/ippiw/CMakeFiles/ippiw.dir/src/iw\_image\_op\_copy\_channel.c.o  
> [3%] Building C object 3rdparty/ippiw/CMakeFiles/ippiw.dir/src/iw\_image\_op\_copy\_make\_border.c.o  
> [3%] Building C object 3rdparty/openjpeg/openjp2/CMakeFiles/libopenjp2.dir/opj\_malloc.c.o  
> [4%] Building C object 3rdparty/ippiw/CMakeFiles/ippiw.dir/src/iw\_image\_op\_copy\_merge.c.o  
> [4%] Building CXX object CMakeFiles/ade.dir/3rdparty/ade/ade-0.1.2d/sources/ade/source/node.cpp.o  
> Note: Class cv::detail::GraphCutSeamFinder has more than 1 base class (not supported by Python C extensions)  
> Bases: cv::detail::GraphCutSeamFinderBase, cv::detail::SeamFinder  
> Only the first base class will be used  
> [4%] Building C object 3rdparty/openjpeg/openjp2/CMakeFiles/libopenjp2.dir/sparse\_array.c.o  
> [4%] Building C object 3rdparty/ippiw/CMakeFiles/ippiw.dir/src/iw\_image\_op\_copy\_split.c.o  
> [4%] Building C object 3rdparty/ippiw/CMakeFiles/ippiw.dir/src/iw\_image\_op\_scale.c.o

This certainly is not easy nor straightforward. Appreciate all your help.

---

<div class="post-metadata">

**Author:** ![BirdingPix](https://avatars.discourse-cdn.com/v4/letter/b/97f17d/32.png) [@BirdingPix](https://forum.opencv.org/u/BirdingPix)\
**Post date:** [April 27, 2024, 12:13am UTC](https://forum.opencv.org/t/cmake-build-fail-opencv-4-9-0-cuda-12-4-cudnn-9-1-0-gcc-11-4/17424/7 "2024-04-27T00:13:41Z")

</div>

Turned OFF TBB. Retry.

Still can get it to go.

> [4%] Linking CXX shared library …/…/lib/libopencv\_cudev.so  
> [4%] Building C object 3rdparty/libwebp/CMakeFiles/libwebp.dir/src/dsp/cost.c.o  
> [4%] Building C object 3rdparty/libwebp/CMakeFiles/libwebp.dir/src/dsp/cost\_mips32.c.o  
> [4%] Building C object 3rdparty/libwebp/CMakeFiles/libwebp.dir/src/dsp/cost\_mips\_dsp\_r2.c.o  
> /usr/bin/ld: cannot find -llib64: No such file or directory  
> [4%] Building C object 3rdparty/libwebp/CMakeFiles/libwebp.dir/src/dsp/cost\_neon.c.o  
> collect2: error: ld returned 1 exit status  
> make[2]: \*\*\* [modules/cudev/CMakeFiles/opencv\_cudev.dir/build.make:99: lib/libopencv\_cudev.so.4.9.0] Error 1  
> make[1]: \*\*\* [CMakeFiles/Makefile2:4852: modules/cudev/CMakeFiles/opencv\_cudev.dir/all] Error 2  
> make[1]: \*\*\* Waiting for unfinished jobs…  
> [4%] Building C object 3rdparty/libwebp/CMakeFiles/libwebp.dir/src/dsp/cost\_sse2.c.o  
> [4%] Building C object 3rdparty/libwebp/CMakeFiles/libwebp.dir/src/dsp/cpu.c.o  
> [4%] Building C object 3rdparty/libwebp/CMakeFiles/libwebp.dir/src/dsp/dec.c.o  
> [4%] Building C object 3rdparty/libwebp/CMakeFiles/libwebp.dir/src/dsp/dec\_clip\_tables.c.o  
> [4%] Building CXX object 3rdparty/protobuf/CMakeFiles/libprotobuf.dir/src/google/protobuf/repeated\_ptr\_field.cc.o  
> [4%] Building CXX object 3rdparty/protobuf/CMakeFiles/libprotobuf.dir/src/google/protobuf/stubs/bytestream.cc.o  
> [4%] Building C object 3rdparty/libwebp/CMakeFiles/libwebp.dir/src/dsp/dec\_mips32.c.o  
> [4%] Building C object 3rdparty/libwebp/CMakeFiles/libwebp.dir/src/dsp/dec\_mips\_dsp\_r2.c.o  
> [4%] Building C object 3rdparty/libwebp/CMakeFiles/libwebp.dir/src/dsp/dec\_msa.c.o  
> [4%] Building CXX object 3rdparty/protobuf/CMakeFiles/libprotobuf.dir/src/google/protobuf/stubs/common.cc.o  
> [4%] Building C object 3rdparty/libwebp/CMakeFiles/libwebp.dir/src/dsp/dec\_sse2.c.o  
> [4%] Building C object 3rdparty/libwebp/CMakeFiles/libwebp.dir/src/dsp/dec\_sse41.c.o  
> [4%] Building C object 3rdparty/libwebp/CMakeFiles/libwebp.dir/src/dsp/dec\_neon.c.o  
> [4%] Building C object 3rdparty/libwebp/CMakeFiles/libwebp.dir/src/dsp/enc.c.o  
> [4%] Building C object 3rdparty/libwebp/CMakeFiles/libwebp.dir/src/dsp/enc\_mips32.c.o  
> [4%] Building C object 3rdparty/libwebp/CMakeFiles/libwebp.dir/src/dsp/enc\_mips\_dsp\_r2.c.o  
> [4%] Building C object 3rdparty/libwebp/CMakeFiles/libwebp.dir/src/dsp/enc\_msa.c.o  
> [4%] Building C object 3rdparty/libwebp/CMakeFiles/libwebp.dir/src/dsp/enc\_neon.c.o  
> [4%] Building CXX object 3rdparty/protobuf/CMakeFiles/libprotobuf.dir/src/google/protobuf/stubs/int128.cc.o  
> [4%] Building CXX object 3rdparty/protobuf/CMakeFiles/libprotobuf.dir/src/google/protobuf/stubs/status.cc.o  
> [4%] Building C object 3rdparty/libwebp/CMakeFiles/libwebp.dir/src/dsp/enc\_sse2.c.o  
> [4%] Building C object 3rdparty/libwebp/CMakeFiles/libwebp.dir/src/dsp/enc\_sse41.c.o  
> [4%] Building C object 3rdparty/libwebp/CMakeFiles/libwebp.dir/src/dsp/filters.c.o  
> [4%] Building C object 3rdparty/libwebp/CMakeFiles/libwebp.dir/src/dsp/filters\_mips\_dsp\_r2.c.o  
> [4%] Building C object 3rdparty/libwebp/CMakeFiles/libwebp.dir/src/dsp/filters\_msa.c.o  
> [4%] Building C object 3rdparty/libwebp/CMakeFiles/libwebp.dir/src/dsp/filters\_neon.c.o  
> [5%] Building C object 3rdparty/libwebp/CMakeFiles/libwebp.dir/src/dsp/filters\_sse2.c.o  
> [5%] Building CXX object 3rdparty/protobuf/CMakeFiles/libprotobuf.dir/src/google/protobuf/stubs/stringpiece.cc.o  
> [5%] Building C object 3rdparty/libwebp/CMakeFiles/libwebp.dir/src/dsp/lossless.c.o  
> [5%] Building CXX object 3rdparty/protobuf/CMakeFiles/libprotobuf.dir/src/google/protobuf/stubs/stringprintf.cc.o  
> [5%] Building C object 3rdparty/libwebp/CMakeFiles/libwebp.dir/src/dsp/lossless\_enc.c.o  
> [5%] Building CXX object 3rdparty/protobuf/CMakeFiles/libprotobuf.dir/src/google/protobuf/stubs/structurally\_valid.cc.o  
> [5%] Building CXX object 3rdparty/protobuf/CMakeFiles/libprotobuf.dir/src/google/protobuf/stubs/strutil.cc.o  
> [5%] Building CXX object 3rdparty/protobuf/CMakeFiles/libprotobuf.dir/src/google/protobuf/wire\_format\_lite.cc.o  
> [5%] Building C object 3rdparty/libwebp/CMakeFiles/libwebp.dir/src/dsp/lossless\_enc\_mips32.c.o  
> [5%] Building C object 3rdparty/libwebp/CMakeFiles/libwebp.dir/src/dsp/lossless\_enc\_mips\_dsp\_r2.c.o  
> [5%] Building C object 3rdparty/libwebp/CMakeFiles/libwebp.dir/src/dsp/lossless\_enc\_msa.c.o  
> [5%] Building C object 3rdparty/libwebp/CMakeFiles/libwebp.dir/src/dsp/lossless\_enc\_neon.c.o  
> [5%] Building C object 3rdparty/libwebp/CMakeFiles/libwebp.dir/src/dsp/lossless\_enc\_sse2.c.o  
> [5%] Building C object 3rdparty/libwebp/CMakeFiles/libwebp.dir/src/dsp/lossless\_enc\_sse41.c.o  
> [5%] Building C object 3rdparty/libwebp/CMakeFiles/libwebp.dir/src/dsp/lossless\_mips\_dsp\_r2.c.o  
> [5%] Building C object 3rdparty/libwebp/CMakeFiles/libwebp.dir/src/dsp/lossless\_msa.c.o  
> [5%] Building C object 3rdparty/libwebp/CMakeFiles/libwebp.dir/src/dsp/lossless\_neon.c.o  
> [5%] Building C object 3rdparty/libwebp/CMakeFiles/libwebp.dir/src/dsp/lossless\_sse2.c.o  
> [5%] Building C object 3rdparty/libwebp/CMakeFiles/libwebp.dir/src/dsp/lossless\_sse41.c.o  
> [5%] Building C object 3rdparty/libwebp/CMakeFiles/libwebp.dir/src/dsp/rescaler.c.o  
> [5%] Building C object 3rdparty/libwebp/CMakeFiles/libwebp.dir/src/dsp/rescaler\_mips32.c.o  
> [5%] Building C object 3rdparty/libwebp/CMakeFiles/libwebp.dir/src/dsp/rescaler\_mips\_dsp\_r2.c.o  
> [5%] Building CXX object 3rdparty/protobuf/CMakeFiles/libprotobuf.dir/src/google/protobuf/any.cc.o  
> [5%] Building C object 3rdparty/libwebp/CMakeFiles/libwebp.dir/src/dsp/rescaler\_neon.c.o  
> [5%] Building CXX object 3rdparty/protobuf/CMakeFiles/libprotobuf.dir/src/google/protobuf/descriptor.cc.o  
> [5%] Building C object 3rdparty/libwebp/CMakeFiles/libwebp.dir/src/dsp/rescaler\_msa.c.o  
> [5%] Building CXX object 3rdparty/protobuf/CMakeFiles/libprotobuf.dir/src/google/protobuf/descriptor.pb.cc.o  
> [5%] Building CXX object 3rdparty/protobuf/CMakeFiles/libprotobuf.dir/src/google/protobuf/descriptor\_database.cc.o  
> [5%] Building C object 3rdparty/libwebp/CMakeFiles/libwebp.dir/src/dsp/rescaler\_sse2.c.o  
> [5%] Building C object 3rdparty/libwebp/CMakeFiles/libwebp.dir/src/dsp/ssim.c.o  
> [5%] Building C object 3rdparty/libwebp/CMakeFiles/libwebp.dir/src/dsp/ssim\_sse2.c.o  
> [5%] Building C object 3rdparty/libwebp/CMakeFiles/libwebp.dir/src/dsp/upsampling.c.o  
> [5%] Building C object 3rdparty/libwebp/CMakeFiles/libwebp.dir/src/dsp/upsampling\_mips\_dsp\_r2.c.o  
> [5%] Building C object 3rdparty/libwebp/CMakeFiles/libwebp.dir/src/dsp/upsampling\_msa.c.o  
> [5%] Building CXX object 3rdparty/protobuf/CMakeFiles/libprotobuf.dir/src/google/protobuf/extension\_set\_heavy.cc.o  
> [5%] Building CXX object 3rdparty/protobuf/CMakeFiles/libprotobuf.dir/src/google/protobuf/dynamic\_message.cc.o  
> [5%] Building CXX object 3rdparty/protobuf/CMakeFiles/libprotobuf.dir/src/google/protobuf/generated\_message\_reflection.cc.o  
> [5%] Building C object 3rdparty/libwebp/CMakeFiles/libwebp.dir/src/dsp/upsampling\_neon.c.o  
> [5%] Building C object 3rdparty/libwebp/CMakeFiles/libwebp.dir/src/dsp/upsampling\_sse2.c.o  
> [6%] Building C object 3rdparty/libwebp/CMakeFiles/libwebp.dir/src/dsp/upsampling\_sse41.c.o  
> [6%] Building C object 3rdparty/libwebp/CMakeFiles/libwebp.dir/src/dsp/yuv.c.o  
> [6%] Building C object 3rdparty/libwebp/CMakeFiles/libwebp.dir/src/dsp/yuv\_mips32.c.o  
> [6%] Building C object 3rdparty/libwebp/CMakeFiles/libwebp.dir/src/dsp/yuv\_mips\_dsp\_r2.c.o  
> [6%] Building CXX object 3rdparty/protobuf/CMakeFiles/libprotobuf.dir/src/google/protobuf/io/tokenizer.cc.o  
> [6%] Building CXX object 3rdparty/protobuf/CMakeFiles/libprotobuf.dir/src/google/protobuf/map\_field.cc.o  
> [6%] Building C object 3rdparty/libwebp/CMakeFiles/libwebp.dir/src/dsp/yuv\_neon.c.o  
> [6%] Building C object 3rdparty/libwebp/CMakeFiles/libwebp.dir/src/dsp/yuv\_sse2.c.o  
> [6%] Building C object 3rdparty/libwebp/CMakeFiles/libwebp.dir/src/dsp/yuv\_sse41.c.o  
> [6%] Building C object 3rdparty/libwebp/CMakeFiles/libwebp.dir/src/enc/alpha\_enc.c.o  
> [6%] Building C object 3rdparty/libwebp/CMakeFiles/libwebp.dir/src/enc/analysis\_enc.c.o  
> [6%] Building C object 3rdparty/libwebp/CMakeFiles/libwebp.dir/src/enc/backward\_references\_cost\_enc.c.o  
> [6%] Building C object 3rdparty/libwebp/CMakeFiles/libwebp.dir/src/enc/backward\_references\_enc.c.o  
> [6%] Built target gen\_opencv\_python\_source  
> [6%] Building C object 3rdparty/libwebp/CMakeFiles/libwebp.dir/src/enc/config\_enc.c.o  
> [6%] Building C object 3rdparty/libwebp/CMakeFiles/libwebp.dir/src/enc/cost\_enc.c.o  
> [6%] Building C object 3rdparty/libwebp/CMakeFiles/libwebp.dir/src/enc/filter\_enc.c.o  
> [6%] Building C object 3rdparty/libwebp/CMakeFiles/libwebp.dir/src/enc/frame\_enc.c.o  
> [6%] Linking CXX static library 3rdparty/lib/libade.a  
> [6%] Building C object 3rdparty/libwebp/CMakeFiles/libwebp.dir/src/enc/histogram\_enc.c.o  
> [6%] Building C object 3rdparty/libwebp/CMakeFiles/libwebp.dir/src/enc/iterator\_enc.c.o  
> [6%] Built target ade  
> [6%] Building C object 3rdparty/libwebp/CMakeFiles/libwebp.dir/src/enc/near\_lossless\_enc.c.o  
> [6%] Building CXX object 3rdparty/protobuf/CMakeFiles/libprotobuf.dir/src/google/protobuf/message.cc.o  
> [6%] Building C object 3rdparty/libwebp/CMakeFiles/libwebp.dir/src/enc/picture\_csp\_enc.c.o  
> [6%] Building CXX object 3rdparty/protobuf/CMakeFiles/libprotobuf.dir/src/google/protobuf/reflection\_ops.cc.o  
> [6%] Building C object 3rdparty/libwebp/CMakeFiles/libwebp.dir/src/enc/picture\_enc.c.o  
> [6%] Building CXX object 3rdparty/protobuf/CMakeFiles/libprotobuf.dir/src/google/protobuf/stubs/substitute.cc.o  
> [6%] Building C object 3rdparty/libwebp/CMakeFiles/libwebp.dir/src/enc/picture\_psnr\_enc.c.o  
> [6%] Building C object 3rdparty/libwebp/CMakeFiles/libwebp.dir/src/enc/picture\_rescale\_enc.c.o  
> [7%] Building CXX object 3rdparty/protobuf/CMakeFiles/libprotobuf.dir/src/google/protobuf/text\_format.cc.o  
> [7%] Building CXX object 3rdparty/protobuf/CMakeFiles/libprotobuf.dir/src/google/protobuf/unknown\_field\_set.cc.o  
> [7%] Building C object 3rdparty/libwebp/CMakeFiles/libwebp.dir/src/enc/picture\_tools\_enc.c.o  
> [7%] Building C object 3rdparty/libwebp/CMakeFiles/libwebp.dir/src/enc/predictor\_enc.c.o  
> [7%] Building C object 3rdparty/libwebp/CMakeFiles/libwebp.dir/src/enc/quant\_enc.c.o  
> [7%] Building C object 3rdparty/libwebp/CMakeFiles/libwebp.dir/src/enc/syntax\_enc.c.o  
> [8%] Building C object 3rdparty/libwebp/CMakeFiles/libwebp.dir/src/enc/token\_enc.c.o  
> [8%] Building C object 3rdparty/libwebp/CMakeFiles/libwebp.dir/src/enc/tree\_enc.c.o  
> [8%] Building C object 3rdparty/libwebp/CMakeFiles/libwebp.dir/src/enc/vp8l\_enc.c.o  
> [8%] Building CXX object 3rdparty/protobuf/CMakeFiles/libprotobuf.dir/src/google/protobuf/wire\_format.cc.o  
> [8%] Building C object 3rdparty/libwebp/CMakeFiles/libwebp.dir/src/enc/webp\_enc.c.o  
> [8%] Building C object 3rdparty/libwebp/CMakeFiles/libwebp.dir/src/mux/anim\_encode.c.o  
> [8%] Building C object 3rdparty/libwebp/CMakeFiles/libwebp.dir/src/mux/muxedit.c.o  
> [8%] Building C object 3rdparty/libwebp/CMakeFiles/libwebp.dir/src/mux/muxinternal.c.o  
> [8%] Building C object 3rdparty/libwebp/CMakeFiles/libwebp.dir/src/mux/muxread.c.o  
> [8%] Building C object 3rdparty/libwebp/CMakeFiles/libwebp.dir/src/utils/bit\_reader\_utils.c.o  
> [8%] Building C object 3rdparty/libwebp/CMakeFiles/libwebp.dir/src/utils/bit\_writer\_utils.c.o  
> [8%] Building C object 3rdparty/libwebp/CMakeFiles/libwebp.dir/src/utils/color\_cache\_utils.c.o  
> [8%] Building C object 3rdparty/libwebp/CMakeFiles/libwebp.dir/src/utils/filters\_utils.c.o  
> [8%] Building C object 3rdparty/libwebp/CMakeFiles/libwebp.dir/src/utils/huffman\_encode\_utils.c.o  
> [8%] Building C object 3rdparty/libwebp/CMakeFiles/libwebp.dir/src/utils/palette.c.o  
> [8%] Building C object 3rdparty/libwebp/CMakeFiles/libwebp.dir/src/utils/huffman\_utils.c.o  
> [8%] Building C object 3rdparty/libwebp/CMakeFiles/libwebp.dir/src/utils/quant\_levels\_dec\_utils.c.o  
> [8%] Building C object 3rdparty/libwebp/CMakeFiles/libwebp.dir/src/utils/quant\_levels\_utils.c.o  
> [8%] Building C object 3rdparty/libwebp/CMakeFiles/libwebp.dir/src/utils/random\_utils.c.o  
> [8%] Building C object 3rdparty/libwebp/CMakeFiles/libwebp.dir/src/utils/rescaler\_utils.c.o  
> [8%] Building C object 3rdparty/libwebp/CMakeFiles/libwebp.dir/src/utils/thread\_utils.c.o  
> [8%] Building C object 3rdparty/libwebp/CMakeFiles/libwebp.dir/src/utils/utils.c.o  
> [8%] Linking C static library …/lib/liblibwebp.a  
> [8%] Built target libwebp  
> [8%] Linking C static library …/…/lib/liblibopenjp2.a  
> [8%] Built target libopenjp2  
> [8%] Linking CXX static library …/lib/liblibprotobuf.a  
> [8%] Built target libprotobuf  
> make: \*\*\* [Makefile:166: all] Error 2  
> dk@ASUS:~$

---

<div class="post-metadata">

**Author:** ![cudawarped](https://avatars.discourse-cdn.com/v4/letter/c/9dc877/32.png) [@cudawarped](https://forum.opencv.org/u/cudawarped)\
**Post date:** [April 27, 2024, 4:30am UTC](https://forum.opencv.org/t/cmake-build-fail-opencv-4-9-0-cuda-12-4-cudnn-9-1-0-gcc-11-4/17424/8 "2024-04-27T04:30:26Z")

</div>

Did you clean your build directory?

---

<div class="post-metadata">

**Author:** ![BirdingPix](https://avatars.discourse-cdn.com/v4/letter/b/97f17d/32.png) [@BirdingPix](https://forum.opencv.org/u/BirdingPix)\
**Post date:** [April 27, 2024, 1:31pm UTC](https://forum.opencv.org/t/cmake-build-fail-opencv-4-9-0-cuda-12-4-cudnn-9-1-0-gcc-11-4/17424/9 "2024-04-27T13:31:54Z")

</div>

Yes, the build folder is deleted after each try. The bash script does a ‘mkdir build’ and 'cd ‘build’ each time.

---

<div class="post-metadata">

**Author:** ![BirdingPix](https://avatars.discourse-cdn.com/v4/letter/b/97f17d/32.png) [@BirdingPix](https://forum.opencv.org/u/BirdingPix)\
**Post date:** [April 27, 2024, 1:41pm UTC](https://forum.opencv.org/t/cmake-build-fail-opencv-4-9-0-cuda-12-4-cudnn-9-1-0-gcc-11-4/17424/10 "2024-04-27T13:41:34Z")

</div>

Just tried another run. Failed as usual.

Here is error:

```none
[4%] Building C object 3rdparty/libwebp/CMakeFiles/libwebp.dir/src/dsp/rescaler_mips_dsp_r2.c.o
[4%] Building C object 3rdparty/libwebp/CMakeFiles/libwebp.dir/src/dsp/rescaler_msa.c.o
[4%] Built target ippiw
[4%] Building C object 3rdparty/libwebp/CMakeFiles/libwebp.dir/src/dsp/rescaler_neon.c.o
[4%] Building C object 3rdparty/libwebp/CMakeFiles/libwebp.dir/src/dsp/rescaler_sse2.c.o
[4%] Building CXX object modules/cudev/CMakeFiles/opencv_cudev.dir/src/stub.cpp.o
[4%] Building CXX object CMakeFiles/ade.dir/3rdparty/ade/ade-0.1.2d/sources/ade/source/memory_descriptor_ref.cpp.o
[4%] Building CXX object CMakeFiles/ade.dir/3rdparty/ade/ade-0.1.2d/sources/ade/source/memory_descriptor_view.cpp.o
[4%] Building C object 3rdparty/libwebp/CMakeFiles/libwebp.dir/src/dsp/ssim.c.o
[4%] Linking CXX shared library ../../lib/libopencv_cudev.so
/usr/bin/ld: cannot find -llib64: No such file or directory
[5%] Building C object 3rdparty/libwebp/CMakeFiles/libwebp.dir/src/dsp/ssim_sse2.c.o
[5%] Building C object 3rdparty/libwebp/CMakeFiles/libwebp.dir/src/dsp/upsampling_mips_dsp_r2.c.o
collect2: error: ld returned 1 exit status
make[2]: *** [modules/cudev/CMakeFiles/opencv_cudev.dir/build.make:99: lib/libopencv_cudev.so.4.9.0] Error 1
make[1]: *** [CMakeFiles/Makefile2:4808: modules/cudev/CMakeFiles/opencv_cudev.dir/all] Error 2
make[1]: *** Waiting for unfinished jobs....
[5%] Building C object 3rdparty/libwebp/CMakeFiles/libwebp.dir/src/dsp/upsampling_msa.c.o
[5%] Building C object 3rdparty/libwebp/CMakeFiles/libwebp.dir/src/dsp/upsampling.c.o

```

Here is my config:

```none
-- General configuration for OpenCV 4.9.0-dev =====================================
-- Version control: unknown
-- 
-- Extra modules:
-- Location (extra): /home/dk/opencv/opencv_contrib-4.x/modules
-- Version control (extra): unknown
-- 
-- Platform:
-- Timestamp: 2024-04-27T13:38:02Z
-- Host: Linux 6.5.0-28-generic x86_64
-- CMake: 3.22.1
-- CMake generator: Unix Makefiles
-- CMake build tool: /usr/bin/gmake
-- Configuration: RELEASE
-- 
-- CPU/HW features:
-- Baseline: SSE SSE2 SSE3
-- requested: SSE3
-- Dispatched code generation: SSE4_1 SSE4_2 FP16 AVX AVX2 AVX512_SKX
-- requested: SSE4_1 SSE4_2 AVX FP16 AVX2 AVX512_SKX
-- SSE4_1 (16 files): + SSSE3 SSE4_1
-- SSE4_2 (1 files): + SSSE3 SSE4_1 POPCNT SSE4_2
-- FP16 (0 files): + SSSE3 SSE4_1 POPCNT SSE4_2 FP16 AVX
-- AVX (8 files): + SSSE3 SSE4_1 POPCNT SSE4_2 AVX
-- AVX2 (36 files): + SSSE3 SSE4_1 POPCNT SSE4_2 FP16 FMA3 AVX AVX2
-- AVX512_SKX (5 files): + SSSE3 SSE4_1 POPCNT SSE4_2 FP16 FMA3 AVX AVX2 AVX_512F AVX512_COMMON AVX512_SKX
-- 
-- C/C++:
-- Built as dynamic libs?: YES
-- C++ standard: 11
-- C++ Compiler: /usr/bin/c++ (ver 11.4.0)
-- C++ flags (Release): -fsigned-char -ffast-math -fno-finite-math-only -W -Wall -Wreturn-type -Wnon-virtual-dtor -Waddress -Wsequence-point -Wformat -Wformat-security -Wmissing-declarations -Wundef -Winit-self -Wpointer-arith -Wshadow -Wsign-promo -Wuninitialized -Wsuggest-override -Wno-delete-non-virtual-dtor -Wno-comment -Wimplicit-fallthrough=3 -Wno-strict-overflow -fdiagnostics-show-option -Wno-long-long -pthread -fomit-frame-pointer -ffunction-sections -fdata-sections -msse -msse2 -msse3 -fvisibility=hidden -fvisibility-inlines-hidden -fopenmp -O3 -DNDEBUG -DNDEBUG
-- C++ flags (Debug): -fsigned-char -ffast-math -fno-finite-math-only -W -Wall -Wreturn-type -Wnon-virtual-dtor -Waddress -Wsequence-point -Wformat -Wformat-security -Wmissing-declarations -Wundef -Winit-self -Wpointer-arith -Wshadow -Wsign-promo -Wuninitialized -Wsuggest-override -Wno-delete-non-virtual-dtor -Wno-comment -Wimplicit-fallthrough=3 -Wno-strict-overflow -fdiagnostics-show-option -Wno-long-long -pthread -fomit-frame-pointer -ffunction-sections -fdata-sections -msse -msse2 -msse3 -fvisibility=hidden -fvisibility-inlines-hidden -fopenmp -g -O0 -DDEBUG -D_DEBUG
-- C Compiler: /usr/bin/cc
-- C flags (Release): -fsigned-char -ffast-math -fno-finite-math-only -W -Wall -Wreturn-type -Waddress -Wsequence-point -Wformat -Wformat-security -Wmissing-declarations -Wmissing-prototypes -Wstrict-prototypes -Wundef -Winit-self -Wpointer-arith -Wshadow -Wuninitialized -Wno-comment -Wimplicit-fallthrough=3 -Wno-strict-overflow -fdiagnostics-show-option -Wno-long-long -pthread -fomit-frame-pointer -ffunction-sections -fdata-sections -msse -msse2 -msse3 -fvisibility=hidden -fopenmp -O3 -DNDEBUG -DNDEBUG
-- C flags (Debug): -fsigned-char -ffast-math -fno-finite-math-only -W -Wall -Wreturn-type -Waddress -Wsequence-point -Wformat -Wformat-security -Wmissing-declarations -Wmissing-prototypes -Wstrict-prototypes -Wundef -Winit-self -Wpointer-arith -Wshadow -Wuninitialized -Wno-comment -Wimplicit-fallthrough=3 -Wno-strict-overflow -fdiagnostics-show-option -Wno-long-long -pthread -fomit-frame-pointer -ffunction-sections -fdata-sections -msse -msse2 -msse3 -fvisibility=hidden -fopenmp -g -O0 -DDEBUG -D_DEBUG
-- Linker flags (Release): -Wl,--exclude-libs,libippicv.a -Wl,--exclude-libs,libippiw.a -Wl,--gc-sections -Wl,--as-needed -Wl,--no-undefined  
-- Linker flags (Debug): -Wl,--exclude-libs,libippicv.a -Wl,--exclude-libs,libippiw.a -Wl,--gc-sections -Wl,--as-needed -Wl,--no-undefined  
-- ccache: NO
-- Precompiled headers: NO
-- Extra dependencies: m pthread cudart_static dl rt nppc nppial nppicc nppidei nppif nppig nppim nppist nppisu nppitc npps cublas lib64 cufft -L/usr/local/cuda/lib64 -L/usr/lib/x86_64-linux-gnu -L/usr/local/cuda
-- 3rdparty dependencies:
-- 
-- OpenCV modules:
-- To be built: aruco bgsegm bioinspired calib3d ccalib core cudaarithm cudabgsegm cudacodec cudafeatures2d cudafilters cudaimgproc cudalegacy cudaobjdetect cudaoptflow cudastereo cudawarping cudev datasets dnn dnn_objdetect dnn_superres dpm face features2d flann freetype fuzzy gapi hfs highgui img_hash imgcodecs imgproc intensity_transform line_descriptor mcc ml objdetect optflow phase_unwrapping photo plot python3 quality rapid reg rgbd saliency shape signal stereo stitching structured_light superres surface_matching text tracking video videoio videostab wechat_qrcode xfeatures2d ximgproc xobjdetect xphoto
-- Disabled: world
-- Disabled by dependency: -
-- Unavailable: alphamat cannops cvv hdf java julia matlab ovis python2 sfm ts viz
-- Applications: examples apps
-- Documentation: NO
-- Non-free algorithms: NO
-- 
-- GUI: GTK3
-- GTK+: YES (ver 3.24.33)
-- GThread : YES (ver 2.72.4)
-- GtkGlExt: NO
-- OpenGL support: NO
-- VTK support: NO
-- 
-- Media I/O: 
-- ZLib: /usr/lib/x86_64-linux-gnu/libz.so (ver 1.2.11)
-- JPEG: /usr/lib/x86_64-linux-gnu/libjpeg.so (ver 80)
-- WEBP: build (ver encoder: 0x020f)
-- PNG: /usr/lib/x86_64-linux-gnu/libpng.so (ver 1.6.37)
-- TIFF: /usr/lib/x86_64-linux-gnu/libtiff.so (ver 42 / 4.3.0)
-- JPEG 2000: build (ver 2.5.0)
-- OpenEXR: /usr/lib/x86_64-linux-gnu/libImath-2_5.so /usr/lib/x86_64-linux-gnu/libIlmImf-2_5.so /usr/lib/x86_64-linux-gnu/libIex-2_5.so /usr/lib/x86_64-linux-gnu/libHalf-2_5.so /usr/lib/x86_64-linux-gnu/libIlmThread-2_5.so (ver 2_5)
-- HDR: YES
-- SUNRASTER: YES
-- PXM: YES
-- PFM: YES
-- 
-- Video I/O:
-- DC1394: NO
-- FFMPEG: YES
-- avcodec: YES (58.134.100)
-- avformat: YES (58.76.100)
-- avutil: YES (56.70.100)
-- swscale: YES (5.9.100)
-- avresample: NO
-- GStreamer: YES (1.20.3)
-- v4l/v4l2: YES (linux/videodev2.h)
-- 
-- Parallel framework: OpenMP
-- 
-- Trace: YES (with Intel ITT)
-- 
-- Other third-party libraries:
-- Intel IPP: 2021.11.0 [2021.11.0]
-- at: /home/dk/opencv/opencv-4.x/build/3rdparty/ippicv/ippicv_lnx/icv
-- Intel IPP IW: sources (2021.11.0)
-- at: /home/dk/opencv/opencv-4.x/build/3rdparty/ippicv/ippicv_lnx/iw
-- VA: NO
-- Lapack: NO
-- Eigen: NO
-- Custom HAL: NO
-- Flatbuffers: builtin/3rdparty (23.5.9)
-- 
-- NVIDIA CUDA: YES (ver 12.3, CUFFT CUBLAS NVCUVID NVCUVENC FAST_MATH)
-- NVIDIA GPU arch: 50 52 60 61 70 75 80 86 89 90
-- NVIDIA PTX archs: 90
-- 
-- cuDNN: YES (ver 8.9.7)
-- 
-- OpenCL: YES (no extra features)
-- Include path: /home/dk/opencv/opencv-4.x/3rdparty/include/opencl/1.2
-- Link libraries: Dynamic load
-- 
-- Python 3:
-- Interpreter: /home/dk/.virtualenvs/cv/bin/python (ver 3.10.12)
-- Libraries: /usr/lib/x86_64-linux-gnu/libpython3.10.so (ver 3.10.12)
-- Limited API: NO
-- numpy: /home/dk/.virtualenvs/cv/lib/python3.10/site-packages/numpy/core/include (ver 1.26.4)
-- install path: ~/.virtualenvs/cv/lib/python3.10/site-packages/cv2/python-3.10
-- 
-- Python (for build): /home/dk/.virtualenvs/cv/bin/python
-- 
-- Java:                          
-- ant: NO
-- Java: NO
-- JNI: NO
-- Java wrappers: NO
-- Java tests: NO
-- 
-- Install to: /usr/local
-- -----------------------------------------------------------------
-- 
-- Configuring done
-- Generating done
-- Build files have been written to: /home/dk/opencv/opencv-4.x/build

```

---

<div class="post-metadata">

**Author:** ![BirdingPix](https://avatars.discourse-cdn.com/v4/letter/b/97f17d/32.png) [@BirdingPix](https://forum.opencv.org/u/BirdingPix)\
**Post date:** [April 28, 2024, 4:13am UTC](https://forum.opencv.org/t/cmake-build-fail-opencv-4-9-0-cuda-12-4-cudnn-9-1-0-gcc-11-4/17424/11 "2024-04-28T04:13:05Z")

</div>

UPDATE: Saturday evening, April 27.

I completely rebuilt the system, starting with clean new Ubuntu 22.04 OS from USB stick.

After a few hours to get all libraries and drivers and opencv all downloaded and installed, I tried a new opencv-4.9.0-dev build.

Thank you for all your help.

```none
-- 
-- General configuration for OpenCV 4.9.0-dev =====================================
-- Version control: unknown
-- 
-- Extra modules:
-- Location (extra): /home/sd/opencv/opencv_contrib-4.x/modules
-- Version control (extra): unknown
-- 
-- Platform:
-- Timestamp: 2024-04-28T03:44:46Z
-- Host: Linux 6.5.0-28-generic x86_64
-- CMake: 3.22.1
-- CMake generator: Unix Makefiles
-- CMake build tool: /usr/bin/gmake
-- Configuration: RELEASE
-- 
-- CPU/HW features:
-- Baseline: SSE SSE2 SSE3
-- requested: SSE3
-- Dispatched code generation: SSE4_1 SSE4_2 FP16 AVX AVX2 AVX512_SKX
-- requested: SSE4_1 SSE4_2 AVX FP16 AVX2 AVX512_SKX
-- SSE4_1 (16 files): + SSSE3 SSE4_1
-- SSE4_2 (1 files): + SSSE3 SSE4_1 POPCNT SSE4_2
-- FP16 (0 files): + SSSE3 SSE4_1 POPCNT SSE4_2 FP16 AVX
-- AVX (8 files): + SSSE3 SSE4_1 POPCNT SSE4_2 AVX
-- AVX2 (36 files): + SSSE3 SSE4_1 POPCNT SSE4_2 FP16 FMA3 AVX AVX2
-- AVX512_SKX (5 files): + SSSE3 SSE4_1 POPCNT SSE4_2 FP16 FMA3 AVX AVX2 AVX_512F AVX512_COMMON AVX512_SKX
-- 
-- C/C++:
-- Built as dynamic libs?: YES
-- C++ standard: 11
-- C++ Compiler: /usr/bin/c++ (ver 11.4.0)
-- C++ flags (Release): -fsigned-char -ffast-math -fno-finite-math-only -W -Wall -Wreturn-type -Wnon-virtual-dtor -Waddress -Wsequence-point -Wformat -Wformat-security -Wmissing-declarations -Wundef -Winit-self -Wpointer-arith -Wshadow -Wsign-promo -Wuninitialized -Wsuggest-override -Wno-delete-non-virtual-dtor -Wno-comment -Wimplicit-fallthrough=3 -Wno-strict-overflow -fdiagnostics-show-option -Wno-long-long -pthread -fomit-frame-pointer -ffunction-sections -fdata-sections -msse -msse2 -msse3 -fvisibility=hidden -fvisibility-inlines-hidden -O3 -DNDEBUG -DNDEBUG
-- C++ flags (Debug): -fsigned-char -ffast-math -fno-finite-math-only -W -Wall -Wreturn-type -Wnon-virtual-dtor -Waddress -Wsequence-point -Wformat -Wformat-security -Wmissing-declarations -Wundef -Winit-self -Wpointer-arith -Wshadow -Wsign-promo -Wuninitialized -Wsuggest-override -Wno-delete-non-virtual-dtor -Wno-comment -Wimplicit-fallthrough=3 -Wno-strict-overflow -fdiagnostics-show-option -Wno-long-long -pthread -fomit-frame-pointer -ffunction-sections -fdata-sections -msse -msse2 -msse3 -fvisibility=hidden -fvisibility-inlines-hidden -g -O0 -DDEBUG -D_DEBUG
-- C Compiler: /usr/bin/cc
-- C flags (Release): -fsigned-char -ffast-math -fno-finite-math-only -W -Wall -Wreturn-type -Waddress -Wsequence-point -Wformat -Wformat-security -Wmissing-declarations -Wmissing-prototypes -Wstrict-prototypes -Wundef -Winit-self -Wpointer-arith -Wshadow -Wuninitialized -Wno-comment -Wimplicit-fallthrough=3 -Wno-strict-overflow -fdiagnostics-show-option -Wno-long-long -pthread -fomit-frame-pointer -ffunction-sections -fdata-sections -msse -msse2 -msse3 -fvisibility=hidden -O3 -DNDEBUG -DNDEBUG
-- C flags (Debug): -fsigned-char -ffast-math -fno-finite-math-only -W -Wall -Wreturn-type -Waddress -Wsequence-point -Wformat -Wformat-security -Wmissing-declarations -Wmissing-prototypes -Wstrict-prototypes -Wundef -Winit-self -Wpointer-arith -Wshadow -Wuninitialized -Wno-comment -Wimplicit-fallthrough=3 -Wno-strict-overflow -fdiagnostics-show-option -Wno-long-long -pthread -fomit-frame-pointer -ffunction-sections -fdata-sections -msse -msse2 -msse3 -fvisibility=hidden -g -O0 -DDEBUG -D_DEBUG
-- Linker flags (Release): -Wl,--exclude-libs,libippicv.a -Wl,--exclude-libs,libippiw.a -Wl,--gc-sections -Wl,--as-needed -Wl,--no-undefined  
-- Linker flags (Debug): -Wl,--exclude-libs,libippicv.a -Wl,--exclude-libs,libippiw.a -Wl,--gc-sections -Wl,--as-needed -Wl,--no-undefined  
-- ccache: NO
-- Precompiled headers: NO
-- Extra dependencies: m pthread cudart_static dl rt nppc nppial nppicc nppidei nppif nppig nppim nppist nppisu nppitc npps cublas cudnn cufft -L/usr/local/cuda/lib64 -L/usr/lib/x86_64-linux-gnu
-- 3rdparty dependencies:
-- 
-- OpenCV modules:
-- To be built: aruco bgsegm bioinspired calib3d ccalib core cudaarithm cudabgsegm cudacodec cudafeatures2d cudafilters cudaimgproc cudalegacy cudaobjdetect cudaoptflow cudastereo cudawarping cudev datasets dnn dnn_objdetect dnn_superres dpm face features2d flann freetype fuzzy gapi hfs highgui img_hash imgcodecs imgproc intensity_transform line_descriptor mcc ml objdetect optflow phase_unwrapping photo plot python3 quality rapid reg rgbd saliency shape signal stereo stitching structured_light superres surface_matching text tracking video videoio videostab wechat_qrcode xfeatures2d ximgproc xobjdetect xphoto
-- Disabled: world
-- Disabled by dependency: -
-- Unavailable: alphamat cannops cvv hdf java julia matlab ovis python2 sfm ts viz
-- Applications: examples apps
-- Documentation: NO
-- Non-free algorithms: NO
-- 
-- GUI: GTK3
-- GTK+: YES (ver 3.24.33)
-- GThread : YES (ver 2.72.4)
-- GtkGlExt: NO
-- OpenGL support: NO
-- VTK support: NO
-- 
-- Media I/O: 
-- ZLib: /usr/lib/x86_64-linux-gnu/libz.so (ver 1.2.11)
-- JPEG: /usr/lib/x86_64-linux-gnu/libjpeg.so (ver 80)
-- WEBP: build (ver encoder: 0x020f)
-- PNG: /usr/lib/x86_64-linux-gnu/libpng.so (ver 1.6.37)
-- TIFF: /usr/lib/x86_64-linux-gnu/libtiff.so (ver 42 / 4.3.0)
-- JPEG 2000: build (ver 2.5.0)
-- OpenEXR: build (ver 2.3.0)
-- HDR: YES
-- SUNRASTER: YES
-- PXM: YES
-- PFM: YES
-- 
-- Video I/O:
-- DC1394: NO
-- FFMPEG: YES
-- avcodec: YES (58.134.100)
-- avformat: YES (58.76.100)
-- avutil: YES (56.70.100)
-- swscale: YES (5.9.100)
-- avresample: NO
-- GStreamer: YES (1.20.3)
-- v4l/v4l2: YES (linux/videodev2.h)
-- 
-- Parallel framework: TBB (ver 2021.5 interface 12050)
-- 
-- Trace: YES (with Intel ITT)
-- 
-- Other third-party libraries:
-- Intel IPP: 2021.11.0 [2021.11.0]
-- at: /home/sd/opencv/opencv-4.x/build/3rdparty/ippicv/ippicv_lnx/icv
-- Intel IPP IW: sources (2021.11.0)
-- at: /home/sd/opencv/opencv-4.x/build/3rdparty/ippicv/ippicv_lnx/iw
-- VA: NO
-- Lapack: NO
-- Eigen: NO
-- Custom HAL: NO
-- Protobuf: build (3.19.1)
-- Flatbuffers: builtin/3rdparty (23.5.9)
-- 
-- NVIDIA CUDA: YES (ver 12.3, CUFFT CUBLAS NVCUVID NVCUVENC FAST_MATH)
-- NVIDIA GPU arch: 50 52 60 61 70 75 80 86 89 90
-- NVIDIA PTX archs: 90
-- 
-- cuDNN: YES (ver 8.9.7)
-- 
-- OpenCL: YES (no extra features)
-- Include path: /home/sd/opencv/opencv-4.x/3rdparty/include/opencl/1.2
-- Link libraries: Dynamic load
-- 
-- Python 3:
-- Interpreter: /home/sd/.virtualenvs/cv/bin/python (ver 3.10.12)
-- Libraries: /usr/lib/x86_64-linux-gnu/libpython3.10.so (ver 3.10.12)
-- Limited API: NO
-- numpy: /home/sd/.virtualenvs/cv/lib/python3.10/site-packages/numpy/core/include (ver 1.26.4)
-- install path: ~/.virtualenvs/cv/lib/python3.10/site-packages/cv2/python-3.10
-- 
-- Python (for build): /home/sd/.virtualenvs/cv/bin/python
-- 
-- Java:                          
-- ant: NO
-- Java: NO
-- JNI: NO
-- Java wrappers: NO
-- Java tests: NO
-- 
-- Install to: /usr/local
-- -----------------------------------------------------------------
-- 
-- Configuring done
-- Generating done
-- Build files have been written to: /home/sd/opencv/opencv-4.x/build

```

---

<div class="post-metadata">

**Author:** ![laurent.berger](https://avatars.discourse-cdn.com/v4/letter/l/ec9cab/32.png) [@laurent.berger](https://forum.opencv.org/u/laurent.berger)\
**Post date:** [April 28, 2024, 10:00am UTC](https://forum.opencv.org/t/cmake-build-fail-opencv-4-9-0-cuda-12-4-cudnn-9-1-0-gcc-11-4/17424/12 "2024-04-28T10:00:18Z")

</div>

> [@BirdingPix](#):
>
> `NVIDIA GPU arch: 50 52 60 61 70 75 80 86 89 90`

I’m not CUDA expert but may be you can reduce compilation time if you set only one GPU arch (your cuda card)

```auto
NVIDIA GPU arch: 50 52 60 61 70 75 80 86 89 90

```

in your cmake command :  
DCUDA\_ARCH\_BIN=x.y

> **[CUDA GPUs - Compute Capability](https://developer.nvidia.com/cuda-gpus)**
>
> Explore your GPU compute capability and CUDA-enabled products.

 ![image](https://us1.discourse-cdn.com/flex020/uploads/opencv/original/2X/5/50a5cd6e4dc879177fbf52fc429daf15e1a197d8.png)

---

<div class="post-metadata">

**Author:** ![BirdingPix](https://avatars.discourse-cdn.com/v4/letter/b/97f17d/32.png) [@BirdingPix](https://forum.opencv.org/u/BirdingPix)\
**Post date:** [April 28, 2024, 1:22pm UTC](https://forum.opencv.org/t/cmake-build-fail-opencv-4-9-0-cuda-12-4-cudnn-9-1-0-gcc-11-4/17424/13 "2024-04-28T13:22:38Z")

</div>

Thank you very much for all your help.

I changed my make bash script to add:  
-D CUDA\_ARCH\_BIN=8.6,8.9,9.0  
-D CUDA\_ARCH\_PTX=9.0

and the total make time was reduced significantly.

I’m using RTX 4070.

Should I just further adjust this and only make with just one value (since it is the only CUDA card that is installed)?  
-D CUDA\_ARCH\_BIN=9.0  
-D CUDA\_ARCH\_PTX=9.0

Again, thank you all for the help. I couldn’t have got this far without this forum!

---

<div class="post-metadata">

**Author:** ![laurent.berger](https://avatars.discourse-cdn.com/v4/letter/l/ec9cab/32.png) [@laurent.berger](https://forum.opencv.org/u/laurent.berger)\
**Post date:** [April 28, 2024, 1:29pm UTC](https://forum.opencv.org/t/cmake-build-fail-opencv-4-9-0-cuda-12-4-cudnn-9-1-0-gcc-11-4/17424/14 "2024-04-28T13:29:42Z")

</div>

ptx is defined [here](https://docs.nvidia.com/cuda/cuda-c-programming-guide/index.html#compilation-with-nvcc)

this blog too is interesting [Matching CUDA arch and CUDA gencode for various NVIDIA architectures - Arnon Shimoni](https://arnon.dk/matching-sm-architectures-arch-and-gencode-for-various-nvidia-cards/)

---

<div class="post-metadata">

**Author:** ![cudawarped](https://avatars.discourse-cdn.com/v4/letter/c/9dc877/32.png) [@cudawarped](https://forum.opencv.org/u/cudawarped)\
**Post date:** [April 28, 2024, 5:33pm UTC](https://forum.opencv.org/t/cmake-build-fail-opencv-4-9-0-cuda-12-4-cudnn-9-1-0-gcc-11-4/17424/15 "2024-04-28T17:33:31Z")

</div>

> [@BirdingPix](#):
>
> Should I just further adjust this and only make with just one value (since it is the only CUDA card that is installed)?  
> -D CUDA\_ARCH\_BIN=9.0  
> -D CUDA\_ARCH\_PTX=9.0

If your building it for the machine you are on just use

```auto
-DCUDA_GENERATION=Auto

```

which in your case will just generate binaries for compute capability 8.9. i.e. It is equivelant to -D CUDA\_ARCH\_BIN=8.9.
