# Not able to build opencv\_viz with VTK=9.0.1 for OpenVINO 2021.3

**URL:** <https://forum.opencv.org/t/not-able-to-build-opencv-viz-with-vtk-9-0-1-for-openvino-2021-3/3731>\
**Category:** Uncategorized\
**Tags:** build\
**Created:** [June 7, 2021, 5:09pm UTC](https://forum.opencv.org/t/not-able-to-build-opencv-viz-with-vtk-9-0-1-for-openvino-2021-3/3731 "2021-06-07T17:09:55Z")\
**Posts on this page:** 2\
**Page:** 1

<div class="post-metadata">

**Author:** ![Startscream](https://sea2.discourse-cdn.com/flex020/user_avatar/forum.opencv.org/startscream/32/76_2.png) [@Startscream](https://forum.opencv.org/u/Startscream)\
**Post date:** [June 7, 2021, 5:09pm UTC](https://forum.opencv.org/t/not-able-to-build-opencv-viz-with-vtk-9-0-1-for-openvino-2021-3/3731/1 "2021-06-07T17:09:55Z")

</div>

System information (version)

```auto
- OpenCV == 4.5.2-openvino
- opencv_contrib == 4.5.2
- opencv_extra == 4.5.2
- Operating System / Platform => Ubuntu 18.04 
- Compiler => g++(8.4)
- VTK == 9.0.1

```

Description

Trying to build OpenCV 4.5.2 with VTK=ON. cmake configuration is successful but module “viz” is causing issues while make.

```auto
[2%] Building CXX object modules/CMakeFiles/ade.dir/__/3rdparty/ade/ade-0.1.1f/sources/ade/source/graph.cpp.o
[2%] Building CXX object modules/CMakeFiles/ade.dir/__/3rdparty/ade/ade-0.1.1f/sources/ade/source/memory_accessor.cpp.o
[2%] Linking C static library ../lib/libippiw.a
Note: Class detail_GraphCutSeamFinder has more than 1 base class (not supported by Python C extensions)
      Bases: cv::detail::GraphCutSeamFinderBase, cv::detail::SeamFinder
      Only the first base class will be used
Generator error: unable to resolve base viz_Widget3D for viz_WMesh
modules/python_bindings_generator/CMakeFiles/gen_opencv_python_source.dir/build.make:489: recipe for target 'modules/python_bindings_generator/pyopencv_generated_enums.h' failed
make[2]: *** [modules/python_bindings_generator/pyopencv_generated_enums.h] Error 255
CMakeFiles/Makefile2:7427: recipe for target 'modules/python_bindings_generator/CMakeFiles/gen_opencv_python_source.dir/all' failed
make[1]: *** [modules/python_bindings_generator/CMakeFiles/gen_opencv_python_source.dir/all] Error 2
make[1]: *** Waiting for unfinished jobs....
[2%] Building CXX object modules/CMakeFiles/ade.dir/__/3rdparty/ade/ade-0.1.1f/sources/ade/source/memory_descriptor.cpp.o
[2%] Built target ippiw
[2%] Building CXX object modules/CMakeFiles/ade.dir/__/3rdparty/ade/ade-0.1.1f/sources/ade/source/memory_descriptor_ref.cpp.o
[2%] Building CXX object modules/CMakeFiles/ade.dir/__/3rdparty/ade/ade-0.1.1f/sources/ade/source/memory_descriptor_view.cpp.o
[2%] Building CXX object modules/CMakeFiles/ade.dir/__/3rdparty/ade/ade-0.1.1f/sources/ade/source/metadata.cpp.o
[2%] Building CXX object modules/CMakeFiles/ade.dir/__/3rdparty/ade/ade-0.1.1f/sources/ade/source/metatypes.cpp.o
[2%] Building CXX object modules/CMakeFiles/ade.dir/__/3rdparty/ade/ade-0.1.1f/sources/ade/source/node.cpp.o
[2%] Linking CXX static library ../../../../../../lib/libnumeric.a
[2%] Building CXX object modules/CMakeFiles/ade.dir/__/3rdparty/ade/ade-0.1.1f/sources/ade/source/passes/communications.cpp.o
[2%] Built target numeric
[2%] Building CXX object modules/CMakeFiles/ade.dir/__/3rdparty/ade/ade-0.1.1f/sources/ade/source/search.cpp.o
[2%] Building CXX object modules/CMakeFiles/ade.dir/__/3rdparty/ade/ade-0.1.1f/sources/ade/source/subgraphs.cpp.o
[2%] Building CXX object modules/CMakeFiles/ade.dir/__/3rdparty/ade/ade-0.1.1f/sources/ade/source/topological_sort.cpp.o
[3%] Linking CXX static library ../lib/libade.a
[3%] Built target ade
Makefile:165: recipe for target 'all' failed
make: *** [all] Error 2
----------------------------------------
[ERROR(2)]

@@@@ BLD: { elapsed: 4.654, user: 18.453, system: 1.648, percent: 431.90 } @@@@

```

---

<div class="post-metadata">

**Author:** ![eryan\_zhang](https://sea2.discourse-cdn.com/flex020/user_avatar/forum.opencv.org/eryan_zhang/32/10775_2.png) [@eryan\_zhang](https://forum.opencv.org/u/eryan_zhang)\
**Post date:** [July 10, 2024, 2:06pm UTC](https://forum.opencv.org/t/not-able-to-build-opencv-viz-with-vtk-9-0-1-for-openvino-2021-3/3731/2 "2024-07-10T14:06:00Z")

</div>

have you solved this problem? I’m troubled by this right now and can’t find any solution
